program: Gaussian 09
title: 000186001
version: EM64L-G09RevD.01
frameworkgroup: C1[X(C17H23NO2)]
method: RPBEPBE
basis: SDD
operation: Freq
keyword: #p
keyword: freq=noraman
keyword: PBEPBE/SDD
title: #p freq=noraman PBEPBE/SDD
converged: YES YES NO NO
title: Mulliken charges:
elementType: O O N C C C C C C C C C C C C C C C C C H H H H H H H H H H H H H H H H H H H H H H H
charge: -0.433889 -0.201569 -0.122768 -0.161849 0.153135 -0.245890 0.134549 0.432226 -0.728739 -0.703219 -0.704380 -0.422935 -0.690904 -0.426169 -0.363130 -0.228090 -0.232796 -0.239431 0.199898 -0.500180 0.191842 0.255590 0.222889 0.218532 0.215477 0.252330 0.218216 0.213545 0.220323 0.202524 0.251896 0.205117 0.265481 0.279778 0.253783 0.183433 0.374255 0.212014 0.295449 0.224640 0.225978 0.227110 0.275928
chargesum: 0.00000
title: Mulliken charges with hydrogens summed into heavy atoms:
elementType: O O N C C C C C C C C C C C C C C C C C
charge: -0.059634 -0.201569 -0.122768 0.029993 0.153135 0.009699 0.134549 0.432226 -0.071841 -0.019129 -0.029637 0.047663 0.026090 -0.214155 -0.067680 -0.003450 -0.006818 -0.012321 0.199898 -0.224251
polarizability: 2.13198740e+02 -3.83074126e+00 2.06515725e+02 1.82200615e+01 -2.41081562e+00 1.54832170e+02
1716.lowfreq: -8.7901 -0.0007 -0.0004 0.0006 4.3254 8.1731 20.8163 32.6880 41.0207
frequency: 20.2346 32.5668 41.0088 53.0574 53.8166 72.7517 91.1947 97.1516 139.1338 161.4143 191.8576 197.3449 220.3986 231.9385 247.9031 265.3184 269.6519 273.4616 279.4876 292.9703 314.8083 321.1507 325.0029 354.2915 363.9322 366.1157 400.1199 407.5671 435.9530 447.6882 484.2427 559.9906 563.9918 586.9440 616.5546 628.4265 659.7564 666.4423 705.5891 727.7765 774.5629 780.1777 810.4126 822.2808 856.5214 876.0300 912.0306 925.2934 927.0439 936.4991 948.4675 952.5173 967.7960 979.2345 990.5342 995.6533 1001.9738 1016.6450 1021.7472 1027.4427 1032.1532 1076.1489 1082.4877 1110.5758 1151.8465 1170.8629 1177.4891 1184.9931 1193.8295 1204.1266 1220.2091 1224.1399 1237.3081 1261.0957 1267.4133 1300.6354 1309.7980 1337.7807 1360.6311 1367.7702 1377.2979 1386.6496 1388.5396 1403.2205 1434.7677 1440.5684 1454.6457 1458.6822 1466.3000 1468.2647 1476.4996 1477.9739 1480.2670 1484.0493 1496.9407 1498.9661 1593.4321 1593.9720 1611.1991 2144.0945 2804.5629 2819.8922 2852.5069 2975.1772 2980.6585 2983.4408 3013.8811 3044.9601 3062.8169 3070.5113 3071.9120 3075.0682 3079.4068 3095.7425 3098.5700 3104.2462 3114.6175 3126.2243 3139.5435 3157.1712 3170.0854 3427.1143 3450.8906
redmass: 3.2944 3.8479 4.2364 4.2263 3.1573 4.8316 4.5542 4.2737 5.3494 3.9742 2.9750 1.2403 2.5964 1.8972 3.4769 1.8938 1.2760 1.6359 1.6340 2.5118 3.2171 3.3023 3.0335 2.9283 2.3978 2.6526 2.9053 2.6608 1.5385 2.4265 3.7033 4.2256 3.8185 3.9662 6.3627 1.2288 1.5961 2.8335 2.0005 2.4585 3.0496 3.8715 4.0375 3.8268 1.2520 3.5179 3.8674 1.7816 1.4981 1.5699 1.2078 2.6238 2.2494 1.3885 6.1198 1.6191 1.8320 1.5162 2.1291 2.0564 1.9457 2.3596 1.8164 1.3050 2.3345 1.0882 1.6144 1.4689 2.5001 1.6545 1.5172 2.6104 1.7745 2.1274 1.3624 1.3170 1.4463 1.4973 1.4373 1.1798 1.1969 4.8103 1.2790 1.2102 1.1728 2.0835 1.0516 1.0929 1.0508 1.0493 1.1078 1.1799 1.7052 1.0491 1.0658 1.0489 6.2760 8.5612 6.1334 6.0280 1.0785 1.0703 1.0581 1.0358 1.0345 1.0355 1.0840 1.0717 1.0866 1.0997 1.0970 1.0997 1.0988 1.1008 1.1009 1.0997 1.0860 1.0870 1.0929 1.0974 1.0973 1.1593 1.0643
irintensity: 0.2924 0.5867 0.1857 0.0547 0.4666 0.5419 0.3866 1.2527 1.5334 1.8387 0.3310 0.7014 0.5367 1.7931 1.2415 0.9092 0.3124 1.5096 1.5314 3.6717 2.9287 8.2306 17.6878 18.4983 0.6480 1.3987 5.6771 8.6442 95.3818 70.9535 4.5033 24.5439 1.2940 1.9811 0.4892 73.7507 49.0452 18.6557 34.2373 53.2396 10.2160 0.2959 4.7743 14.6355 0.4510 24.9885 8.4794 4.5454 4.7199 2.7901 0.1829 17.2253 10.1298 0.7003 1.1369 25.7595 39.2363 22.7074 42.1939 32.9282 35.4764 37.5582 23.5817 4.2606 21.3302 0.4360 2.1017 4.5419 8.2496 11.7205 12.1064 4.0808 49.0112 24.0678 11.7731 42.6316 18.3871 16.7573 7.4582 14.3800 23.7417 9.9742 27.3201 21.4806 2.7927 14.7873 1.6943 0.8036 2.7005 4.4482 17.6243 5.6261 7.0234 11.6667 27.7094 46.4817 8.5697 52.4740 2.2644 2.1843 71.1693 79.6587 168.9274 21.1419 34.2450 20.2170 6.6845 20.7213 26.8298 3.5853 1.6999 58.1623 75.8299 10.8051 12.8011 20.2524 9.2624 1.9718 33.1628 27.4229 9.4627 68.7849 25.0209
temp: 298.150 k
press: 1.00000 atm
elementType: 8 8 7 6 6 6 6 6 6 6 6 6 6 6 6 6 6 6 6 6 1 1 1 1 1 1 1 1 1 1 1 1 1 1 1 1 1 1 1 1 1 1 1
symmnumber: 1
zpe: 937982.9 jmol-1
zpe.correction: 0.357259 hartree
zpe.thermalcorrener: 0.379250 hartree
zpe.thermalcorrenthalpy: 0.380194 hartree
zpe.thermalcorrgfe: 0.305736 hartree
zpe.sumelectzpe: -865.185350 hartree
zpe.sumelectthermal: -865.163359 hartree
zpe.sumelectthermalent: -865.162415 hartree
zpe.sumelectthermalfe: -865.236872 hartree
dipole: -1.4170 -1.4276 -2.9958
dipole: 3.6084
quadrupole: -116.3518 -113.7486 -123.4099
quadrupole: 5.4439 6.6671 -0.0954
quadrupole: 1.4850 4.0882 -5.5731 5.4439 6.6671 -0.0954
hfenergy: -865.5426084 hartree
pointgroup: C01 [X(C17H23N1O2)]
dipole: -0.5155047 0.6315786 1.1622377 debye
polarizability: 211.5933624|2.479948|206.0382737|-20.6487351|-5.894228|156.914999 unknown
InChI: InChI=1S/C17H23NO2/c1-6-12-18(5)14(13-10-8-7-9-11-13)15(19)16(20)17(2,3)4/h1,7-11,14-15,19H,12H2,2-5H3
charge 0 multiplicity 1
43 atoms
O  -0.565941 0.355853 -2.278819
O  -2.505744 -0.964429 -0.984149
N  1.483606 1.365505 -0.295776
C  0.27518 0.579835 0.085052
C  -3.17781 0.833809 0.525861
C  -0.897563 0.82202 -0.944866
C  -2.210398 0.153694 -0.475806
C  0.626941 -0.907504 0.185019
C  -2.772614 2.275109 0.92058
C  -4.577583 0.862499 -0.163788
C  -3.267204 -0.060866 1.799287
C  2.462331 1.367771 0.824841
C  1.268231 2.702292 -0.881048
C  0.178263 -1.698052 1.270188
C  1.403414 -1.514243 -0.835805
C  0.485719 -3.0760 1.334582
C  1.709177 -2.891297 -0.774043
C  1.248896 -3.678068 0.308387
C  3.795059 1.872849 0.445788
C  4.920229 2.297503 0.175105
H  -0.116478 0.917844 1.083029
H  -1.064245 1.907676 -1.028872
H  -3.510771 2.673646 1.640348
H  -2.7618 2.955782 0.049256
H  -1.781342 2.317846 1.407266
H  -4.887839 -0.156944 -0.446865
H  -4.56519 1.486123 -1.076606
H  -5.323671 1.285769 0.533462
H  -4.083436 0.304534 2.448962
H  -2.329359 -0.031116 2.383524
H  -3.476508 -1.108305 1.522405
H  2.092861 1.969878 1.697207
H  2.568782 0.325878 1.181512
H  0.767332 2.608754 -1.857847
H  2.254657 3.162434 -1.05882
H  0.680283 3.397554 -0.228446
H  -0.881479 -0.58936 -2.33754
H  -0.405946 -1.23662 2.076541
H  1.776766 -0.882171 -1.647038
H  0.135452 -3.675005 2.182738
H  2.309354 -3.351295 -1.567456
H  1.489538 -4.746217 0.355743
H  5.901952 2.658136 -0.071889
