program: Gaussian 09
title: 000186031
version: EM64L-G09RevD.01
frameworkgroup: C1[X(C12H23O7PS)]
method: RPBEPBE
basis: SDD
operation: Freq
keyword: #p
keyword: freq=noraman
keyword: PBEPBE/SDD
title: #p freq=noraman PBEPBE/SDD
converged: YES YES NO NO
title: Mulliken charges:
elementType: S P O O O O O O O C C C C C C C C C C C C H H H H H H H H H H H H H H H H H H H H H H H
charge: -0.002213 1.117426 -0.520818 -0.482993 -0.267124 -0.259887 -0.595595 -0.227111 -0.244693 -0.583821 -0.519114 0.344426 0.278061 -0.224897 -0.242974 -0.220943 -0.261797 -0.660553 -0.648637 -0.694569 -0.663801 0.386030 0.273547 0.282681 0.223486 0.250164 0.231710 0.230310 0.227784 0.235686 0.227603 0.233174 0.211170 0.234861 0.237850 0.210786 0.229055 0.253162 0.283082 0.209857 0.212008 0.230264 0.247514 0.219844
chargesum: 0.00000
title: Mulliken charges with hydrogens summed into heavy atoms:
elementType: S P O O O O O O O C C C C C C C C C C C C
charge: -0.002213 1.117426 -0.520818 -0.482993 -0.267124 -0.259887 -0.595595 -0.227111 -0.244693 -0.197791 0.037114 0.344426 0.278061 0.248753 0.219046 0.242527 0.198981 0.023328 0.044365 0.010377 0.033821
polarizability: 2.29188331e+02 3.81207355e-01 2.09411857e+02 1.15056023e+01 2.65315660e+00 1.67236127e+02
1716.lowfreq: -34.1277 -16.9596 -12.8988 -7.5944 0.0011 0.0012 0.0015 7.9174 16.9726
frequency: -33.7936 -12.9367 14.1635 28.3952 33.1379 38.3922 44.4464 48.7474 51.4283 61.4961 67.8821 80.3052 100.8793 106.8273 110.8794 135.0437 144.2341 153.9010 170.4549 197.6965 199.5823 211.8179 228.6653 231.3387 237.3905 247.8127 276.4431 280.8305 303.3429 312.6201 332.6976 342.3152 355.4382 362.5344 413.2144 419.7984 468.6782 515.7791 550.3835 571.1316 601.4344 640.8596 659.1483 696.9739 731.9800 786.8464 800.1656 804.3436 804.6655 814.3135 817.1569 858.3178 864.1523 902.0233 925.6998 956.5881 1005.0658 1010.0961 1011.9093 1018.9316 1036.4428 1092.5326 1093.5607 1096.0674 1099.8236 1116.1810 1127.8722 1133.7783 1138.9994 1142.9309 1147.5947 1158.1656 1184.9294 1238.4962 1252.3002 1257.6029 1263.0334 1273.6751 1278.5371 1341.9095 1348.8273 1350.0674 1357.4840 1371.7512 1386.6327 1388.6748 1392.7621 1402.2866 1434.8446 1456.2527 1456.7533 1458.6714 1463.8462 1464.1682 1469.0391 1473.0771 1475.0846 1484.1154 1484.3957 1486.5775 1495.9621 1629.7346 1641.3302 2988.9220 2989.9457 2990.7956 2994.1991 3000.0329 3000.8001 3004.2845 3012.2728 3031.5623 3057.2354 3070.2201 3070.6801 3077.9048 3085.2452 3085.5583 3086.5665 3088.3826 3089.4016 3094.6277 3104.3136 3109.9155 3114.3900 3121.1339
redmass: 2.0947 2.8931 3.8514 4.3897 3.9542 5.0005 3.7015 3.6942 4.3029 2.9296 3.9105 3.7126 3.8972 4.2424 3.8888 3.7379 4.7163 3.1890 6.0360 2.2098 1.9658 3.0349 2.5205 1.3689 1.6973 1.7326 2.4875 2.8502 5.2255 3.8812 4.3836 4.5999 4.0798 3.6719 3.4964 3.7281 9.9788 4.1222 4.6172 4.2376 6.4274 6.1237 6.6587 4.5689 6.0514 2.3587 1.1176 1.1086 1.1153 2.5722 1.9507 3.8060 4.2740 3.7137 3.1986 3.1021 2.5694 2.6847 2.5788 2.4008 15.5068 4.2092 2.2343 2.2160 2.2174 2.2145 2.0033 1.4959 1.4505 1.5263 2.8257 1.7068 1.3252 1.1796 1.1402 1.1353 1.1260 1.6365 1.1345 1.2205 1.3087 1.2394 1.3706 1.7687 1.2301 1.2477 1.2324 1.2513 1.0780 1.0408 1.0423 1.0923 1.0448 1.0381 1.0725 1.0716 1.0749 1.0596 1.0516 1.0571 1.0572 10.7966 8.9740 1.0356 1.0365 1.0360 1.0360 1.0668 1.0616 1.0581 1.0579 1.0599 1.0859 1.1063 1.1054 1.1031 1.0968 1.0929 1.0971 1.0999 1.0974 1.1027 1.1036 1.1030 1.1028 1.1064
irintensity: 1.1079 0.5650 0.4423 1.6734 0.2983 1.3968 1.4219 0.4776 1.1153 1.6185 1.3516 1.3688 0.8338 0.1136 0.0367 7.4465 1.3537 1.8759 1.7957 4.1238 4.3632 4.0991 4.6149 1.7129 4.5575 1.5874 2.1069 20.9362 9.1256 14.6980 11.8876 15.4495 7.6110 7.0578 4.4668 13.5966 91.3295 23.1422 4.5047 7.0563 95.9845 8.6191 105.3791 0.5000 6.8596 13.8834 11.1766 3.5072 4.3995 5.3896 1.6541 86.8252 177.1092 57.3208 12.2023 17.4533 135.6110 38.3738 91.5869 122.6203 91.5056 14.0455 2.2877 35.8656 8.0006 30.1167 300.2992 19.1917 6.1728 10.5620 14.6201 23.2523 115.0375 5.7798 0.9855 1.3780 0.8940 252.2823 23.2166 11.0965 1.6313 7.7557 5.7516 11.4396 27.4591 29.0067 24.6921 27.4574 36.5616 9.5704 8.8069 10.5483 13.0606 14.1819 1.8078 1.4119 5.7565 16.4273 10.8404 6.1244 20.2905 310.0634 56.9217 23.0862 20.2472 15.3347 19.2307 4.4216 20.9240 38.8863 22.4002 26.1320 11.2035 8.8750 6.1145 6.0816 22.3745 2.7823 31.5447 37.8025 31.7094 1.2896 21.2269 29.5448 31.3344 32.5949
temp: 298.150 k
press: 1.00000 atm
elementType: 16 15 8 8 8 8 8 8 8 6 6 6 6 6 6 6 6 6 6 6 6 1 1 1 1 1 1 1 1 1 1 1 1 1 1 1 1 1 1 1 1 1 1 1
symmnumber: 1
zpe: 910812.5 jmol-1
zpe.correction: 0.346910 hartree
zpe.thermalcorrener: 0.373229 hartree
zpe.thermalcorrenthalpy: 0.374173 hartree
zpe.thermalcorrgfe: 0.286617 hartree
zpe.sumelectzpe: -1735.232176 hartree
zpe.sumelectthermal: -1735.205857 hartree
zpe.sumelectthermalent: -1735.204913 hartree
zpe.sumelectthermalfe: -1735.292469 hartree
dipole: -3.0946 0.4688 3.5799
dipole: 4.7551
quadrupole: -125.4327 -140.2353 -141.4130
quadrupole: -12.4350 10.6543 -2.4602
quadrupole: 10.2610 -4.5416 -5.7193 -12.4350 10.6543 -2.4602
hfenergy: -1735.5790862 hartree
pointgroup: C01 [X(C12H23O7P1S1)]
dipole: 1.0012823 -0.6299844 1.449317 debye
polarizability: 226.4269836|-7.6595226|212.6918603|-10.1848216|0.7571806|166.7174706 unknown
InChI: InChI=1S/C8H13O4S.C4H10O3P/c1-3-11-7(9)5-6(13)8(10)12-4-2;1-3-6-8(5)7-4-2/h6H,3-5H2,1-2H3;3-4H2,1-2H3
charge 0 multiplicity 1
44 atoms
S  -0.176254 -0.03584 -1.731329
P  -2.233727 -0.446905 -0.729795
O  -1.764658 -0.540725 0.94023
O  -2.514886 -2.074204 -1.229144
O  -1.051803 2.585254 -0.040611
O  3.880677 -0.8996 -0.522713
O  -3.484209 0.476935 -1.048244
O  0.963064 3.360092 -0.929344
O  2.100265 -1.216983 0.954057
C  0.68145 0.974218 -0.337434
C  2.198009 0.795739 -0.483607
C  0.257018 2.429807 -0.476167
C  2.673922 -0.538915 0.070214
C  -2.609639 0.124362 1.985054
C  -1.544946 -3.168838 -0.907416
C  -1.702175 3.910166 -0.315377
C  4.532259 -2.150213 -0.016001
C  -1.664211 0.664739 3.053523
C  -1.890534 -3.840385 0.42204
C  -3.159402 3.781122 0.113189
C  5.388107 -1.852347 1.217835
H  0.306737 0.534468 0.602173
H  2.702993 1.602279 0.085164
H  2.536049 0.915869 -1.525798
H  -3.289571 -0.649312 2.387037
H  -3.206326 0.924805 1.512494
H  -0.514841 -2.763045 -0.908439
H  -1.661609 -3.859155 -1.759626
H  -1.148337 4.686232 0.243052
H  -1.597167 4.113382 -1.396125
H  5.138984 -2.487034 -0.871272
H  3.74279 -2.888661 0.208832
H  -2.251381 1.074256 3.897091
H  -1.03414 1.470792 2.641288
H  -1.01266 -0.136849 3.441297
H  -1.234655 -4.719042 0.5718
H  -2.938071 -4.187606 0.422169
H  -1.738801 -3.144281 1.26339
H  -3.637015 2.93346 -0.407282
H  -3.241147 3.622488 1.203364
H  -3.702908 4.709957 -0.138963
H  6.133309 -1.067972 1.00038
H  4.75946 -1.526275 2.063399
H  5.929283 -2.766635 1.52452
