program: Gaussian 09
title: 000185967
version: EM64L-G09RevD.01
frameworkgroup: C1[X(C15H17O3P)]
method: RPBEPBE
basis: SDD
operation: Freq
keyword: #p
keyword: freq=noraman
keyword: PBEPBE/SDD
title: #p freq=noraman PBEPBE/SDD
converged: NO YES NO NO
title: Mulliken charges:
elementType: P O O O C C C C C C C C C C C C C C C H H H H H H H H H H H H H H H H H
charge: 1.220713 -0.542513 -0.542680 -0.612046 0.383779 0.386203 -0.870518 0.480078 0.486142 -0.477458 -0.476824 -0.394494 -0.398353 -0.442149 -0.448016 -0.181313 -0.181320 -0.803515 -0.804750 0.276459 0.274955 0.282848 0.289653 0.292836 0.253038 0.252724 0.232255 0.232247 0.227031 0.226777 0.235480 0.231998 0.221297 0.220843 0.235140 0.233452
chargesum: 0.00000
title: Mulliken charges with hydrogens summed into heavy atoms:
elementType: P O O O C C C C C C C C C C C C C C C
charge: 1.220713 -0.542513 -0.542680 -0.612046 0.383779 0.386203 -0.036255 0.480078 0.486142 -0.187805 -0.183988 -0.141456 -0.145629 -0.209894 -0.215769 0.045718 0.045457 -0.114740 -0.115314
polarizability: 1.73672972e+02 8.40071950e+00 2.09822999e+02 1.68119581e+01 6.15989109e+00 1.85625519e+02
1716.lowfreq: -19.1805 -11.7055 -4.0186 -0.0008 0.0003 0.0009 7.7463 10.8529 14.9121
frequency: -17.4616 -3.5018 11.1891 19.3296 42.6503 46.4213 86.1730 98.0661 139.8849 154.5075 172.6084 203.1961 209.1316 226.1284 231.1407 234.1375 244.0778 294.9720 342.0385 363.3200 378.6255 428.0643 438.8551 440.7675 498.9381 511.9036 517.5588 526.0863 565.9449 574.4687 622.6624 653.3335 692.4422 694.5336 718.6228 766.9257 778.9583 787.6832 790.6959 884.1588 887.3169 908.1947 914.6814 916.6933 923.9521 939.2706 967.1262 974.6396 976.0657 986.0019 987.1753 1002.2256 1004.7469 1047.9022 1049.1881 1050.3371 1087.8894 1088.4024 1138.3544 1149.8701 1171.8321 1172.4439 1241.0215 1247.9306 1301.5531 1306.1696 1345.5655 1378.1833 1379.2281 1396.3137 1397.1186 1420.8973 1424.2330 1435.6709 1435.7866 1468.9751 1469.6376 1474.9535 1476.0845 1481.1899 1484.0205 1594.2036 1597.7862 1609.1370 1610.7923 2978.6113 2978.8637 3033.5170 3058.5621 3058.6283 3086.7189 3086.9363 3127.2903 3127.5713 3142.5814 3148.2687 3149.0736 3152.8549 3155.5636 3161.5229 3174.3614 3174.5337
redmass: 1.1944 3.5377 2.7357 5.0098 6.3945 1.0283 5.1431 4.6921 1.0166 5.0173 3.1413 3.1681 3.1589 3.7802 5.5234 5.2034 5.3834 6.4066 3.3927 5.2681 4.0588 6.4537 2.8977 2.8787 5.8797 5.3242 5.2385 5.7572 4.0430 4.4768 7.6354 7.4829 2.1921 2.2221 6.3661 7.7434 6.9402 1.4336 1.4477 1.3048 1.2997 1.6831 1.9162 1.6644 2.9314 1.6286 1.3671 1.3377 1.3393 5.8020 5.4553 1.5814 1.6003 2.6742 1.8394 1.8195 1.5032 1.4958 1.9614 1.9557 1.1142 1.1177 3.3865 3.6306 1.2950 1.2838 1.1680 7.0972 6.9163 1.2553 1.2576 2.5508 2.5974 1.0465 1.0464 1.0518 1.0515 1.5604 1.3619 1.5839 1.8426 6.0552 6.0464 6.5548 6.4543 1.0372 1.0372 1.0316 1.0973 1.0972 1.0992 1.0992 1.0871 1.0870 1.0932 1.0934 1.0939 1.0932 1.1023 1.1025 1.0973 1.0973
irintensity: 0.2691 0.1875 0.1373 0.1863 0.0797 0.4215 4.6000 5.3338 0.0411 3.0365 2.3695 3.1442 1.2114 1.1124 3.4969 2.8464 0.6319 6.3552 6.5865 54.7775 6.4996 58.7129 18.8270 6.0734 3.7721 1.0343 0.3288 11.9399 1.4674 6.5123 9.4371 75.7943 28.2831 13.9977 16.9587 126.7491 105.8931 78.7362 59.0201 4.6297 2.3572 12.0312 107.0993 106.9404 148.4698 0.8033 70.4243 0.5529 0.5708 4.3905 3.6535 13.9196 22.8426 75.9300 41.4019 11.4995 8.2350 19.9591 100.8678 95.6903 1.4482 1.8334 68.5702 78.0994 0.1049 0.0692 24.5649 0.1917 1.7843 3.8973 27.7885 31.8833 37.0260 14.1179 14.3196 16.5512 8.1005 5.5003 10.5451 51.4025 80.4958 57.9203 66.9730 13.5405 81.2357 20.6322 36.5525 0.0666 29.7139 8.9662 15.5260 25.6048 6.7995 8.8746 0.4419 21.5434 27.0280 2.3191 1.1397 0.5348 3.6861 11.7501
temp: 298.150 k
press: 1.00000 atm
elementType: 15 8 8 8 6 6 6 6 6 6 6 6 6 6 6 6 6 6 6 1 1 1 1 1 1 1 1 1 1 1 1 1 1 1 1 1
symmnumber: 1
zpe: 738732.5 jmol-1
zpe.correction: 0.281368 hartree
zpe.thermalcorrener: 0.299745 hartree
zpe.thermalcorrenthalpy: 0.300689 hartree
zpe.thermalcorrgfe: 0.232297 hartree
zpe.sumelectzpe: -1147.313130 hartree
zpe.sumelectthermal: -1147.294753 hartree
zpe.sumelectthermalent: -1147.293809 hartree
zpe.sumelectthermalfe: -1147.362202 hartree
dipole: -0.1543 -0.2462 1.1807
dipole: 1.2159
quadrupole: -118.3468 -100.7645 -117.8658
quadrupole: 2.0673 3.3713 2.8053
quadrupole: -6.0211 11.5612 -5.5401 2.0673 3.3713 2.8053
hfenergy: -1147.5944985 hartree
pointgroup: C01 [X(C15H17O3P1)]
dipole: -0.1372328 0.1063913 -0.4457321 debye
polarizability: 166.672959|-2.1926705|211.173826|-12.2628903|8.8458075|191.2747046 unknown
InChI: InChI=1S/C15H17O3P/c1-12-6-4-8-14(10-12)17-19(3,16)18-15-9-5-7-13(2)11-15/h4-11H,1-3H3
charge 0 multiplicity 1
36 atoms
P  0.141363 -2.434608 0.642902
O  -1.296479 -1.920438 -0.218196
O  1.464261 -2.141304 -0.46076
O  0.311866 -1.847006 2.115443
C  -1.833058 -0.597328 -0.192911
C  2.139384 -0.897269 -0.64296
C  -0.016101 -4.255398 0.416165
C  -2.571402 1.417815 0.979665
C  2.982451 1.264517 0.127347
C  -1.973885 0.130853 1.007855
C  2.261727 0.067889 0.379107
C  -2.276395 -0.085108 -1.430967
C  2.72912 -0.715873 -1.912547
C  -3.0225 1.937449 -0.259918
C  3.581203 1.452505 -1.14347
C  -2.879837 1.189862 -1.452453
C  3.457529 0.467744 -2.151756
C  -2.733643 2.207516 2.267702
C  3.100629 2.318492 1.215305
H  0.8993 -4.738523 0.788371
H  -0.889343 -4.607427 0.984994
H  -0.150063 -4.468437 -0.653756
H  -1.614475 -0.297027 1.949743
H  1.804104 -0.110584 1.358746
H  -2.145737 -0.680671 -2.33902
H  2.613182 -1.49033 -2.676139
H  -3.486096 2.930289 -0.29151
H  4.145542 2.370545 -1.343755
H  -3.232409 1.60412 -2.403429
H  3.925659 0.624035 -3.12994
H  -3.467435 1.725523 2.941338
H  -1.779724 2.272756 2.8225
H  -3.084645 3.234724 2.06942
H  3.777363 3.135999 0.913215
H  2.114172 2.763968 1.445209
H  3.487371 1.884032 2.155462
