program: Gaussian 09
title: 000185973
version: EM64L-G09RevD.01
frameworkgroup: C1[X(C19H25NO2)]
method: RPBEPBE
basis: SDD
operation: Freq
keyword: #p
keyword: freq=noraman
keyword: PBEPBE/SDD
title: #p freq=noraman PBEPBE/SDD
converged: NO YES NO NO
title: Mulliken charges:
elementType: O O N C C C C C C C C C C C C C C C C C C C H H H H H H H H H H H H H H H H H H H H H H H H H
charge: -0.237954 -0.425697 -0.077846 0.233840 -0.156082 -0.260695 -0.489938 -0.168149 -0.425986 -0.389836 0.432979 -0.482527 -0.534406 -0.458169 0.019702 -0.789383 0.125879 -0.552894 -0.734292 -0.372102 0.268495 -0.413775 0.229931 0.273136 0.214966 0.205839 0.287638 0.213994 0.217157 0.216039 0.202299 0.230073 0.227139 0.218490 0.240215 0.198638 0.214949 0.216111 0.241316 0.221570 0.264661 0.241241 0.226564 0.214547 0.283839 0.227910 0.360575
chargesum: 0.00000
title: Mulliken charges with hydrogens summed into heavy atoms:
elementType: O O N C C C C C C C C C C C C C C C C C C C
charge: -0.237954 -0.065123 -0.077846 0.233840 0.073850 0.012441 -0.069133 0.119488 0.005165 0.028502 0.432979 -0.025316 -0.075701 -0.044582 0.019702 -0.110386 0.125879 -0.288234 -0.051940 -0.088263 0.268495 -0.185865
polarizability: 2.85081381e+02 -1.03719797e+01 2.11684676e+02 1.04080795e+01 8.62520181e+00 1.57538963e+02
1716.lowfreq: -3.2101 -0.0008 -0.0007 -0.0006 4.2432 14.7495 33.5265 47.3462 59.6486
frequency: 33.4918 47.2929 59.6038 91.4539 101.1541 115.7223 126.6647 132.2875 150.9397 173.4733 195.3763 218.2851 225.7425 235.8445 259.1704 282.7304 295.9326 308.5960 322.1130 349.4246 355.4646 368.7001 379.9650 390.3115 391.2648 427.7464 452.5216 461.1511 470.9388 506.3704 543.9713 568.7328 621.8161 632.9561 660.2437 676.9779 681.8632 726.8610 745.9391 756.9278 769.2555 786.8589 797.1009 819.9433 830.6846 833.7881 881.6233 892.6647 899.0374 919.7891 933.3900 942.7032 964.4766 972.6286 976.2917 990.9653 1015.0324 1030.9243 1035.3034 1048.8639 1058.2798 1062.7721 1066.2054 1081.1743 1095.9143 1104.8879 1120.8654 1122.7885 1137.7147 1148.9274 1152.6395 1162.2398 1172.2248 1182.1106 1191.6604 1213.2061 1224.0649 1233.9514 1242.4593 1266.3563 1269.2308 1277.7624 1287.8381 1297.7587 1313.8856 1326.3328 1329.7205 1333.3832 1345.3092 1351.5067 1371.5609 1387.5338 1389.4566 1396.7138 1400.3568 1440.5210 1442.9027 1452.5917 1462.7691 1471.0082 1474.2090 1480.1442 1480.5358 1485.8594 1491.3260 1493.0090 1502.5171 1554.9764 1573.0181 1626.7425 2875.3534 2884.0512 2976.6910 2983.5691 2985.9164 2986.3462 2990.4180 2991.1473 3007.5897 3027.3535 3044.9870 3048.2586 3070.9436 3073.9653 3080.7613 3089.2649 3094.5150 3099.5238 3119.9678 3126.6324 3153.9740 3170.8570 3186.8127 3206.2966 3578.8461
redmass: 4.8998 4.2812 3.5229 3.4818 3.7402 4.0367 3.1280 2.7021 2.6502 1.5362 1.8444 1.7940 3.0453 2.1312 3.1516 3.2306 2.9402 4.0885 4.1890 2.4968 3.2114 2.6975 3.3000 1.4052 1.9736 4.3618 3.4009 3.8363 3.4434 3.8751 3.1447 3.0299 3.7967 3.9297 5.2182 4.9079 3.3017 4.4637 1.9060 2.4039 1.3140 2.0144 2.1070 1.6463 1.4285 2.2561 1.9061 1.8890 1.9215 2.0810 2.4999 2.1521 1.7270 2.1521 1.3560 2.3539 1.8273 1.4149 2.6584 1.8136 1.3185 2.2011 2.8872 2.1727 2.2537 2.4043 1.5406 1.5877 1.5942 1.3357 2.0699 2.1689 1.4551 2.1597 2.3748 1.5747 1.4479 1.8055 1.3301 2.1375 1.3763 1.4281 1.4541 2.0793 1.4923 1.3562 1.4583 1.3843 1.4227 1.4897 1.4762 1.8604 2.2770 1.2460 1.6099 2.2306 1.0909 1.2949 1.1478 1.1856 1.2580 1.6988 1.1748 1.0746 1.0570 1.0856 1.1048 8.5682 7.0690 6.6122 1.0708 1.0691 1.0788 1.0399 1.0589 1.0430 1.0887 1.0607 1.0839 1.0984 1.0850 1.1019 1.0972 1.0989 1.0997 1.0515 1.0995 1.0615 1.0894 1.0915 1.0948 1.0906 1.1168 1.1146 1.0660
irintensity: 0.3873 0.6385 0.2484 2.3731 0.7031 0.3999 0.5199 2.1366 0.1686 0.5771 0.3748 3.1720 4.6412 4.5703 1.1966 1.0884 8.6443 0.9750 2.1126 5.7357 8.6043 5.0194 7.0668 88.2330 52.0340 1.2355 3.3643 1.2427 6.5313 8.9148 8.6597 9.6346 14.4446 8.7252 3.8085 2.0819 5.6752 13.1965 1.1834 3.9645 4.5184 13.1153 7.6650 26.0583 19.9034 23.6115 12.8090 3.9981 13.4832 20.6417 18.7953 6.7673 11.4567 3.3700 2.6713 11.8783 19.8859 22.4544 18.3652 4.4941 10.4050 14.2050 20.8396 12.2286 33.0190 18.8407 0.4091 12.3114 36.5889 161.5006 48.1403 27.6035 4.6025 11.8537 1.1873 0.2781 2.8065 3.2172 4.8210 93.3759 0.8129 9.9301 46.7505 40.2932 21.4417 16.9069 4.9451 8.2804 10.0898 8.9180 6.7334 8.6992 30.6699 26.6042 10.4631 34.3612 8.6389 9.0580 4.6312 16.8089 1.4631 3.8859 13.6570 4.6867 2.3841 12.1559 13.2882 110.1073 192.3683 137.1714 23.3818 100.0512 15.6440 42.5032 1.8157 29.3508 31.6478 38.3177 69.1541 13.8069 13.8140 41.6744 31.8294 44.0596 44.0413 30.3323 22.3091 14.9920 16.4194 2.2710 8.3103 5.0669 0.7726 31.9216 61.0551
temp: 298.150 k
press: 1.00000 atm
elementType: 8 8 7 6 6 6 6 6 6 6 6 6 6 6 6 6 6 6 6 6 6 6 1 1 1 1 1 1 1 1 1 1 1 1 1 1 1 1 1 1 1 1 1 1 1 1 1
symmnumber: 1
zpe: 1048480.9 jmol-1
zpe.correction: 0.399345 hartree
zpe.thermalcorrener: 0.420087 hartree
zpe.thermalcorrenthalpy: 0.421032 hartree
zpe.thermalcorrgfe: 0.351257 hartree
zpe.sumelectzpe: -942.527500 hartree
zpe.sumelectthermal: -942.506758 hartree
zpe.sumelectthermalent: -942.505814 hartree
zpe.sumelectthermalfe: -942.575588 hartree
dipole: 2.3996 0.6519 1.4080
dipole: 2.8576
quadrupole: -125.2325 -127.5156 -132.9061
quadrupole: -12.3049 -2.3681 -3.5147
quadrupole: 3.3189 1.0358 -4.3547 -12.3049 -2.3681 -3.5147
hfenergy: -942.9268454 hartree
pointgroup: C01 [X(C19H25N1O2)]
dipole: 0.9314842 -0.3152157 -0.544909 debye
polarizability: 285.54485|7.435206|211.8430493|-11.349958|6.1802792|156.917121 unknown
InChI: InChI=1S/C19H25NO2/c1-3-19-8-9-20(11-13-4-5-13)17(12(19)2)18(22)15-7-6-14(21)10-16(15)19/h6-7,10,12-13,17,21H,3-5,8-9,11H2,1-2H3
charge 0 multiplicity 1
47 atoms
O  -0.954241 2.170793 1.309363
O  5.041796 0.989221 -0.780247
N  -1.851884 -0.171019 -0.693945
C  0.763123 -1.457974 -0.178623
C  -0.382243 -1.439478 0.897021
C  -1.243141 -0.173548 0.675125
C  0.097079 -1.445836 -1.597758
C  -3.948776 0.978908 0.126527
C  -0.868247 -0.264781 -1.806064
C  -2.865144 0.894922 -0.938227
C  1.602838 -0.166862 -0.034681
C  -4.968033 -0.159397 0.275941
C  -5.407895 1.19395 -0.306053
C  1.633332 -2.746821 -0.065843
C  -0.411535 1.099869 0.882415
C  -1.273653 -2.699664 0.936788
C  1.015777 1.043443 0.466178
C  2.953946 -0.12691 -0.443407
C  2.33371 -2.967329 1.292189
C  1.791146 2.230385 0.555846
C  3.708939 1.062666 -0.350844
C  3.134149 2.256766 0.155729
H  0.093021 -1.327601 1.893731
H  -2.075052 -0.156205 1.399519
H  -0.454595 -2.396014 -1.728394
H  0.885076 -1.412403 -2.374972
H  -3.641026 1.494316 1.042587
H  -0.289419 0.680864 -1.943551
H  -1.440399 -0.420606 -2.741298
H  -2.387462 1.900435 -1.033937
H  -3.326812 0.661284 -1.919172
H  -5.309946 -0.426136 1.280454
H  -4.874271 -1.007139 -0.409609
H  -5.623942 1.243952 -1.378464
H  -6.037166 1.844076 0.308504
H  2.388838 -2.746884 -0.876368
H  0.981204 -3.614216 -0.28377
H  -1.998014 -2.611477 1.76807
H  -1.857675 -2.810553 0.007681
H  -0.689396 -3.621104 1.106114
H  3.460197 -1.012399 -0.835314
H  2.991781 -2.119679 1.553917
H  1.602872 -3.09212 2.111593
H  2.956363 -3.880284 1.263074
H  1.296513 3.12728 0.943423
H  3.72555 3.178468 0.227276
H  5.498213 1.861345 -0.677925
