program: Gaussian 09
title: 000185952
version: EM64L-G09RevD.01
frameworkgroup: C1[X(C14H19NO2)]
method: RPBEPBE
basis: SDD
operation: Freq
keyword: #p
keyword: freq=noraman
keyword: PBEPBE/SDD
title: #p freq=noraman PBEPBE/SDD
converged: YES YES NO NO
title: Mulliken charges:
elementType: O O N C C C C C C C C C C C C C C H H H H H H H H H H H H H H H H H H H
charge: -0.202368 -0.203407 -0.275766 0.021310 -0.432879 -0.432764 -0.393851 -0.394287 -0.393524 0.129114 0.131407 0.059670 0.088010 -0.495042 -0.496135 -0.414911 -0.414605 0.229100 0.235181 0.207226 0.207389 0.234875 0.201267 0.194425 0.194478 0.201277 0.200023 0.197679 0.233740 0.247497 0.233788 0.247883 0.215787 0.211477 0.215425 0.211511
chargesum: 0.00000
title: Mulliken charges with hydrogens summed into heavy atoms:
elementType: O O N C C C C C C C C C C C C C C
charge: -0.202368 -0.203407 -0.275766 0.250410 0.009528 0.009500 0.001841 0.001468 0.004177 0.129114 0.131407 0.059670 0.088010 -0.013804 -0.014465 0.012353 0.012332
polarizability: 1.91084507e+02 3.37148465e+00 1.62278610e+02 -1.34223527e-01 -1.60996561e+00 1.14421017e+02
1716.lowfreq: -13.7994 -7.2538 -0.0009 -0.0007 0.0005 6.4949 33.3680 52.9743 64.3856
frequency: 32.1349 52.9510 64.2039 106.8850 117.7318 149.1284 173.1037 216.1964 224.8936 230.7662 247.7424 276.5300 320.1289 326.6876 379.0179 426.8208 436.7843 439.3699 453.7879 469.7005 510.6313 539.8602 625.6373 646.3955 705.7755 731.6624 738.6718 783.1895 788.3159 817.3750 832.2478 845.4681 855.2336 884.9692 895.8262 897.6706 921.3863 928.8215 953.8273 996.2653 1046.3384 1052.4484 1056.5995 1074.0275 1076.3573 1078.1820 1088.6292 1111.1772 1122.7953 1146.2444 1162.0401 1195.8672 1196.1631 1228.2410 1229.3310 1250.2113 1258.7031 1264.4127 1265.5448 1308.5900 1327.3134 1330.2823 1332.4541 1335.0161 1337.4023 1339.6861 1340.7885 1347.7148 1351.6313 1375.5929 1384.6429 1447.7744 1452.7524 1461.8563 1464.1728 1468.0700 1470.1950 1472.1850 1472.5225 1481.9995 1607.2847 1662.8212 1675.1107 2967.0634 2967.6207 2971.5704 2972.9135 2973.0776 2985.8589 2987.3809 2988.5331 2988.9193 2994.2250 3029.5434 3030.0692 3031.3043 3031.9960 3039.8049 3051.5594 3052.3075 3058.5219 3060.0200
redmass: 4.1002 3.3311 3.6151 2.8405 3.7014 7.9554 3.1157 1.7889 4.9892 6.2037 2.6349 1.9482 2.2613 3.2640 4.5392 3.1658 2.8589 3.4135 2.9685 2.0713 3.0799 3.0407 7.9376 3.4574 5.4519 5.0119 4.9258 2.5201 1.4352 1.7867 2.6952 1.9040 2.5550 2.0061 1.5951 1.5711 1.7239 3.0985 2.4569 2.4924 2.0065 3.4972 1.1689 3.7252 1.3167 1.9481 2.0810 2.6190 1.1488 1.6490 2.5065 2.5301 1.5755 1.5384 1.3723 1.3070 1.2801 1.3357 1.2806 1.3034 1.5287 1.3503 1.3599 2.5063 1.4886 1.3605 1.4764 1.7948 1.7270 1.5197 3.2134 1.1086 1.0752 1.0879 1.0867 1.0861 1.0910 1.0851 1.0889 1.0930 12.2860 12.3270 8.4982 1.0628 1.0636 1.0625 1.0649 1.0648 1.0661 1.0751 1.0609 1.0602 1.0700 1.0933 1.0981 1.0942 1.0946 1.1030 1.0983 1.1039 1.1040 1.1027
irintensity: 0.7208 1.0641 0.6020 1.7523 0.1242 5.8455 1.1881 0.0019 1.7826 0.8023 1.6197 2.6390 4.0894 7.2558 0.1141 3.5820 0.7703 0.2288 3.6842 1.5296 1.0722 3.3645 6.8288 8.0179 17.5830 6.4742 0.9902 2.1163 0.4561 3.1155 0.7470 7.5296 6.1125 8.5247 11.3072 10.6465 0.0059 2.3893 14.0098 30.5378 1.7893 21.6011 0.9994 4.0092 0.7965 0.4273 1.8642 0.0908 1.6950 4.2258 6.0473 0.2668 0.1895 5.8961 3.1714 4.3942 0.9585 4.0873 4.6168 0.2451 33.5696 13.4669 1.4746 246.0022 3.4946 0.4069 0.6037 82.3769 23.6644 20.1447 2.2795 0.4102 33.1677 6.8635 3.7862 10.2802 11.1228 17.2546 8.4042 4.4260 424.8751 11.3902 23.6903 24.8758 46.6548 32.2049 19.3452 4.1436 29.9162 0.7191 23.8526 39.9210 28.6641 23.3408 77.0591 5.2483 59.4277 33.2895 56.0646 5.0684 51.0945 59.9227
temp: 298.150 k
press: 1.00000 atm
elementType: 8 8 7 6 6 6 6 6 6 6 6 6 6 6 6 6 6 1 1 1 1 1 1 1 1 1 1 1 1 1 1 1 1 1 1 1
symmnumber: 1
zpe: 803754.5 jmol-1
zpe.correction: 0.306134 hartree
zpe.thermalcorrener: 0.321475 hartree
zpe.thermalcorrenthalpy: 0.322419 hartree
zpe.thermalcorrgfe: 0.263297 hartree
zpe.sumelectzpe: -748.836421 hartree
zpe.sumelectthermal: -748.821080 hartree
zpe.sumelectthermalent: -748.820136 hartree
zpe.sumelectthermalfe: -748.879259 hartree
dipole: 1.9555 -0.4147 0.0124
dipole: 1.9990
quadrupole: -83.5158 -114.8275 -99.4358
quadrupole: -2.2158 0.0776 0.5626
quadrupole: 15.7439 -15.5678 -0.1761 -2.2158 0.0776 0.5626
hfenergy: -749.1425554 hartree
pointgroup: C01 [X(C14H19N1O2)]
dipole: -0.7683933 0.1676655 0.0045979 debye
polarizability: 191.123114|3.2019299|162.2436547|0.1484067|1.5537992|114.4173656 unknown
InChI: InChI=1S/C14H19NO2/c16-13-11-8-4-5-9-12(11)14(17)15(13)10-6-2-1-3-7-10/h10H,1-9H2
charge 0 multiplicity 1
36 atoms
O  -0.320656 -2.506211 -0.094947
O  0.198261 2.166466 0.088372
N  0.339874 -0.218146 -0.004015
C  1.807472 -0.425015 -0.013207
C  2.462919 0.199487 -1.271177
C  2.465169 0.096986 1.289198
C  3.986859 -0.071062 -1.277694
C  3.989037 -0.173636 1.272023
C  4.657441 0.44204 0.019205
C  -1.971651 -0.645027 -0.024498
C  -1.815109 0.710594 0.033856
C  -0.608336 -1.282346 -0.048861
C  -0.340626 1.02885 0.047011
C  -3.29272 -1.359097 -0.046582
C  -2.940588 1.704294 0.061549
C  -4.42836 -0.376066 0.349843
C  -4.267891 1.005122 -0.340717
H  1.933189 -1.526299 -0.057386
H  2.275639 1.28991 -1.271492
H  1.992014 -0.220866 -2.180404
H  1.995322 -0.394175 2.162773
H  2.279119 1.184198 1.376834
H  4.445556 0.408336 -2.163699
H  4.167446 -1.161942 -1.374791
H  4.169925 -1.268678 1.281005
H  4.449075 0.233344 2.192857
H  5.738866 0.205074 0.008638
H  4.568558 1.546889 0.06386
H  -3.473088 -1.771506 -1.06068
H  -3.266282 -2.235003 0.62922
H  -3.024666 2.140101 1.078399
H  -2.716582 2.555952 -0.608627
H  -5.409057 -0.81578 0.090775
H  -4.417919 -0.233112 1.44871
H  -5.124267 1.656189 -0.08575
H  -4.284545 0.863232 -1.439604
