program: Gaussian 09
title: 000185966
version: EM64L-G09RevD.01
frameworkgroup: C1[X(C15H17O3P)]
method: RPBEPBE
basis: SDD
operation: Freq
keyword: #p
keyword: freq=noraman
keyword: PBEPBE/SDD
title: #p freq=noraman PBEPBE/SDD
converged: YES YES NO NO
title: Mulliken charges:
elementType: P O O O C C C C C C C C C C C C C C C H H H H H H H H H H H H H H H H H
charge: 1.216805 -0.545294 -0.545141 -0.601755 0.233830 0.237592 0.321142 0.308890 -0.869570 -0.322379 -0.341360 -0.383586 -0.381442 -0.795765 -0.782210 -0.221540 -0.222191 -0.237833 -0.241315 0.277180 0.275101 0.279935 0.273106 0.296715 0.232580 0.232791 0.244279 0.240048 0.218395 0.217375 0.240701 0.231062 0.230042 0.230365 0.226685 0.226761
chargesum: 0.00000
title: Mulliken charges with hydrogens summed into heavy atoms:
elementType: P O O O C C C C C C C C C C C C C C C
charge: 1.216805 -0.545294 -0.545141 -0.601755 0.233830 0.237592 0.321142 0.308890 -0.037354 -0.049273 -0.044644 -0.151006 -0.148651 -0.093044 -0.093072 0.008502 0.008174 -0.011148 -0.014553
polarizability: 1.81422296e+02 1.39473606e+00 2.04190368e+02 2.87610588e+01 6.53552418e+00 1.78880266e+02
1716.lowfreq: -10.5063 -6.9995 -0.0020 -0.0017 -0.0013 4.0393 8.7793 17.6804 28.1244
frequency: -4.7195 17.6049 27.9896 35.3393 87.7154 99.5835 102.7645 117.1303 141.6198 141.7171 172.4763 183.2145 196.1133 203.0326 231.6651 245.4072 272.0725 286.5203 340.9226 350.8094 422.2926 436.8193 440.0766 457.1980 469.4586 487.7318 537.6410 541.0187 572.5165 579.4131 622.7504 653.7855 714.8080 717.1672 721.9259 763.2304 764.4379 766.4456 777.6212 842.3056 849.3033 858.6627 871.3322 936.9805 939.0934 948.4176 965.7728 980.5730 982.8415 983.3681 984.9336 1040.2101 1042.5734 1046.8300 1048.5394 1054.6021 1097.5318 1104.4602 1159.9072 1168.2710 1172.8989 1179.1044 1227.6756 1234.4518 1280.7704 1287.3906 1345.8751 1375.2349 1375.7528 1398.8436 1400.4548 1426.3199 1427.5132 1435.9162 1436.2300 1458.3060 1461.9348 1474.3410 1475.7874 1479.3175 1483.9840 1590.6742 1592.5929 1607.0887 1608.6295 2981.7829 2982.0190 3033.0148 3059.2569 3061.6054 3090.8957 3091.3783 3123.2782 3123.5105 3138.1608 3138.9549 3152.8917 3155.0334 3158.4108 3160.6300 3167.2329 3175.1346
redmass: 3.8112 5.7556 3.8686 5.4499 3.6843 1.1288 4.3108 1.0784 3.0256 1.0518 3.4197 3.3689 4.5284 4.7859 4.1120 4.0040 4.3666 5.1892 4.2999 6.6759 3.9407 3.1247 3.0093 5.0314 5.2050 5.5149 3.6684 4.1479 6.1640 6.4819 7.7905 7.4048 2.6521 3.2315 5.5775 1.3431 1.5095 4.0507 4.9654 5.7132 6.1365 1.3492 1.2999 1.5079 1.4167 1.3629 1.3415 1.3237 1.5952 1.5270 1.3730 2.3041 2.1642 1.5383 1.5303 4.0651 2.5485 2.2527 1.9785 1.5706 1.1111 1.3340 2.6735 2.7794 1.4559 1.4236 1.1684 7.4246 7.1930 1.2562 1.2526 1.9360 1.9543 1.0479 1.0570 1.0477 1.0496 1.3665 1.2894 2.0802 2.0241 6.1226 6.1816 6.9316 6.9198 1.0369 1.0366 1.0316 1.0969 1.0965 1.0999 1.1000 1.0872 1.0870 1.0893 1.0898 1.0944 1.1023 1.0957 1.1025 1.1008 1.0984
irintensity: 0.0217 0.2780 0.0360 0.1206 2.4387 1.4120 4.0096 0.5936 1.0082 0.0306 6.0279 0.4863 1.6169 1.9923 9.8347 1.1564 4.7725 1.7763 15.2222 48.3466 15.9851 12.7444 1.7993 73.8629 1.2249 10.5673 1.0880 2.0190 0.2881 5.3991 7.6002 62.8187 7.2480 0.2584 21.7531 121.8360 22.5480 93.8924 103.7430 131.4303 141.1592 3.7117 5.0354 6.4032 7.9139 3.8379 100.3445 0.6503 2.0399 2.3045 2.1800 50.8895 11.5997 3.0141 14.2212 83.2019 78.6614 81.3684 76.1815 46.2224 9.9234 38.4458 25.8998 41.7698 0.1745 0.2313 26.1775 0.4505 1.2370 8.8740 16.8142 15.3149 26.4178 12.0649 17.3169 13.5666 3.0973 9.4347 10.5313 58.4994 92.4918 11.2522 16.6203 12.1676 5.6952 34.9585 14.2975 0.0994 23.8640 17.7320 15.9772 26.9263 5.0523 7.9738 13.7448 16.4933 8.8680 1.0408 26.0855 0.8062 21.4893 6.2248
temp: 298.150 k
press: 1.00000 atm
elementType: 15 8 8 8 6 6 6 6 6 6 6 6 6 6 6 6 6 6 6 1 1 1 1 1 1 1 1 1 1 1 1 1 1 1 1 1
symmnumber: 1
zpe: 739512.4 jmol-1
zpe.correction: 0.281665 hartree
zpe.thermalcorrener: 0.300643 hartree
zpe.thermalcorrenthalpy: 0.301587 hartree
zpe.thermalcorrgfe: 0.233052 hartree
zpe.sumelectzpe: -1147.312897 hartree
zpe.sumelectthermal: -1147.293920 hartree
zpe.sumelectthermalent: -1147.292976 hartree
zpe.sumelectthermalfe: -1147.361511 hartree
dipole: 0.5142 -0.0954 2.5228
dipole: 2.5764
quadrupole: -117.9868 -104.3316 -119.0596
quadrupole: 1.1832 5.2619 5.9907
quadrupole: -4.1941 9.4611 -5.2670 1.1832 5.2619 5.9907
hfenergy: -1147.5945628 hartree
pointgroup: C01 [X(C15H17O3P1)]
dipole: -0.1224433 0.2468565 -0.9754783 debye
polarizability: 163.9816131|4.0687501|201.4931824|-23.7690334|6.666558|199.0181345 unknown
InChI: InChI=1S/C15H17O3P/c1-12-8-4-6-10-14(12)17-19(3,16)18-15-11-7-5-9-13(15)2/h4-11H,1-3H3
charge 0 multiplicity 1
36 atoms
P  0.14031 -2.3223 -0.131025
O  -1.35866 -1.521916 -0.565413
O  1.390781 -1.346505 -0.870588
O  0.321631 -2.651554 1.417562
C  -2.000966 -0.530419 0.239691
C  1.912075 -0.128275 -0.338132
C  -2.327912 0.693786 -0.401249
C  2.453075 0.763712 -1.302527
C  0.113609 -3.706745 -1.346002
C  -2.347368 -0.803384 1.580531
C  1.92931 0.148641 1.046784
C  -3.041543 1.648987 0.36407
C  3.016424 1.97028 -0.819659
C  -1.916685 0.956806 -1.835132
C  2.429413 0.420801 -2.778154
C  -3.048351 0.17579 2.318616
C  2.491255 1.366252 1.490539
C  -3.399569 1.401514 1.709484
C  3.036787 2.27858 0.560193
H  1.082324 -4.226718 -1.311712
H  -0.697348 -4.398661 -1.074432
H  -0.060885 -3.293821 -2.349648
H  -2.060829 -1.757402 2.032562
H  1.515757 -0.574448 1.757441
H  -3.311538 2.602532 -0.105153
H  3.441229 2.67647 -1.543119
H  -0.815963 0.926817 -1.941767
H  -2.32398 0.189254 -2.517644
H  -2.268017 1.94736 -2.170211
H  2.836804 1.249769 -3.381497
H  3.02454 -0.487321 -2.986573
H  1.40173 0.206337 -3.125321
H  -3.318436 -0.022819 3.361358
H  2.504738 1.592499 2.562093
H  -3.947226 2.161527 2.277226
H  3.475785 3.221275 0.90391
