program: Gaussian 09
title: 000185940
version: EM64L-G09RevD.01
frameworkgroup: C1[X(C9H7ClF3N3O4)]
method: RPBEPBE
basis: SDD
operation: Freq
keyword: #p
keyword: freq=noraman
keyword: PBEPBE/SDD
title: #p freq=noraman PBEPBE/SDD
converged: YES YES NO NO
title: Mulliken charges:
elementType: Cl F F F O O O O N N N C C C C C C C C C H H H H H H H
charge: 0.094589 -0.156582 -0.149725 -0.148832 -0.164467 -0.149059 -0.187538 -0.202973 -0.141504 -0.021551 0.002273 0.278735 0.480195 0.294465 0.439137 -0.534633 -0.586459 -0.646469 -0.643126 0.270488 0.321466 0.259529 0.254424 0.264455 0.250175 0.243858 0.279131
chargesum: 0.00000
title: Mulliken charges with hydrogens summed into heavy atoms:
elementType: Cl F F F O O O O N N N C C C C C C C C C
charge: 0.094589 -0.156582 -0.149725 -0.148832 -0.164467 -0.149059 -0.187538 -0.202973 -0.141504 -0.021551 0.002273 0.278735 0.480195 0.294465 0.439137 -0.534633 -0.264994 0.131939 0.130037 0.270488
polarizability: 2.07351460e+02 -6.25034342e+00 1.88744956e+02 -9.62930310e-01 4.32328781e+00 9.08832935e+01
1716.lowfreq: -9.8956 -6.1423 -0.0015 -0.0013 0.0004 1.7794 34.8886 41.4665 59.8328
frequency: 34.8861 41.4087 59.8291 66.6212 75.1027 102.3924 112.2546 128.5178 172.0884 178.3109 194.9536 210.9373 226.0914 237.9489 260.1637 264.0221 284.5053 288.3050 296.8775 313.7622 350.3569 377.7875 394.9287 413.8064 435.7809 467.9780 498.7294 534.2509 569.6924 601.9267 604.8248 649.7304 680.4228 685.9522 707.1458 715.9426 741.8159 772.1216 840.4104 879.2217 947.2628 967.5604 1001.3947 1026.1862 1062.3086 1073.7738 1090.2631 1125.8315 1129.9521 1174.5262 1191.4815 1204.3283 1221.2798 1266.6628 1335.1512 1359.8004 1369.3130 1379.3863 1407.5190 1429.3481 1437.0439 1466.4907 1468.5089 1479.8465 1489.5284 1512.6886 1545.6890 1608.4379 2978.1096 2984.5356 3065.5435 3068.0867 3105.1269 3121.1044 3186.0140
redmass: 7.9105 14.7634 20.3024 6.5673 11.1883 9.5953 4.6107 13.7359 5.6396 5.5054 12.9708 1.7769 7.3398 2.3002 1.5723 3.0900 9.1413 4.2945 8.5508 8.8046 4.8330 6.8879 5.6643 7.6455 4.4654 8.7542 10.6064 7.1622 10.4149 8.9959 11.6128 8.5825 9.3943 10.6888 12.3236 9.0960 8.9698 10.2371 9.5463 11.1059 1.4961 3.9087 8.2466 12.2665 1.5486 9.7971 1.2239 1.7621 2.0727 2.1865 6.1380 4.0904 6.5113 3.6475 9.3746 7.8899 3.4939 10.7967 8.0118 1.2282 1.3894 1.1150 1.1079 1.1082 1.0851 3.4524 4.0227 7.9885 1.0341 1.0360 1.1013 1.1020 1.1008 1.0999 1.0918
irintensity: 2.1561 0.2332 1.6982 1.7832 1.3998 0.9477 5.9222 0.9471 3.2866 0.5836 0.5471 0.6084 2.2776 2.6330 1.4835 3.8128 1.1077 3.2294 0.4353 2.0607 1.3159 1.1154 2.5243 1.8810 3.0379 6.6538 1.2017 12.2358 18.7974 11.4040 20.1913 3.3103 23.4337 16.2968 10.2508 6.1437 3.0433 0.7861 32.2068 20.4806 63.9835 32.4242 185.8022 120.4653 13.5412 207.6707 10.3160 15.8750 39.2757 46.9801 349.9345 122.8434 74.5391 174.2413 147.7283 48.1351 33.4772 120.2995 37.8761 5.4403 27.5962 4.5805 25.9501 7.6267 15.8872 82.4371 91.0748 316.7693 23.6252 51.4947 24.2965 2.5357 9.1982 6.9005 17.3375
temp: 298.150 k
press: 1.00000 atm
elementType: 17 9 9 9 8 8 8 8 7 7 7 6 6 6 6 6 6 6 6 6 1 1 1 1 1 1 1
symmnumber: 1
zpe: 435152.9 jmol-1
zpe.correction: 0.165741 hartree
zpe.thermalcorrener: 0.184894 hartree
zpe.thermalcorrenthalpy: 0.185839 hartree
zpe.thermalcorrgfe: 0.117438 hartree
zpe.sumelectzpe: -1570.211943 hartree
zpe.sumelectthermal: -1570.192790 hartree
zpe.sumelectthermalent: -1570.191846 hartree
zpe.sumelectthermalfe: -1570.260246 hartree
dipole: -4.3467 -1.0799 0.5670
dipole: 4.5146
quadrupole: -115.4011 -142.0195 -122.8274
quadrupole: 4.9381 -2.6433 2.7166
quadrupole: 11.3482 -15.2701 3.9219 4.9381 -2.6433 2.7166
hfenergy: -1570.3776843 hartree
pointgroup: C01 [X(C9H7Cl1F3N3O4)]
dipole: 1.7362443 0.3407241 0.1554244 debye
polarizability: 206.2662074|-6.9947173|181.6559052|3.2330094|-27.5739785|99.0575971 unknown
InChI: InChI=1S/C9H7ClF3N3O4/c1-14(2)7-5(15(17)18)3-4(9(11,12)13)6(10)8(7)16(19)20/h3H,1-2H3
charge 0 multiplicity 1
27 atoms
Cl -2.115154 2.339879 -0.738225
F  -3.478682 -1.838449 0.468328
F  -3.787026 0.331544 1.033357
F  -3.793513 -0.285492 -1.148714
O  1.450861 2.987712 0.4129
O  0.750006 2.960729 -1.761152
O  0.812129 -3.473821 1.092239
O  2.404305 -2.678516 -0.336461
N  2.601617 0.181279 0.021787
N  0.879419 2.429307 -0.597821
N  1.32785 -2.533978 0.368071
C  1.235921 -0.008024 -0.048022
C  0.32738 1.062018 -0.385001
C  0.590089 -1.25561 0.274666
C  -1.66002 -0.312828 0.030567
C  -1.070535 0.919243 -0.366156
C  -0.808264 -1.378954 0.356914
C  3.356893 1.06258 -0.89454
C  3.437745 -0.509041 1.021089
C  -3.151638 -0.516132 0.092218
H  -1.224775 -2.351672 0.630039
H  2.769759 1.295262 -1.79548
H  4.262158 0.519597 -1.219594
H  3.661645 2.004752 -0.402184
H  2.818474 -0.898702 1.844837
H  4.144647 0.228787 1.442519
H  4.001309 -1.348974 0.575416
