program: Gaussian 09
title: 000185922
version: EM64L-G09RevD.01
frameworkgroup: C1[X(C9H12)]
method: RPBEPBE
basis: SDD
operation: Freq
keyword: #p
keyword: freq=noraman
keyword: PBEPBE/SDD
title: #p freq=noraman PBEPBE/SDD
converged: YES YES NO NO
title: Mulliken charges:
elementType: C C C C C C C C C H H H H H H H H H H H H
charge: -0.349590 -0.468672 -0.684663 0.064510 -0.480351 -0.657947 0.070877 -0.098401 -0.080657 0.215578 0.215486 0.229774 0.229950 0.226230 0.210886 0.210955 0.236910 0.236499 0.227859 0.216982 0.227786
chargesum: 0.00000
title: Mulliken charges with hydrogens summed into heavy atoms:
elementType: C C C C C C C C C
charge: 0.081474 -0.008949 -0.036592 0.064510 -0.006942 0.014680 0.070877 -0.098401 -0.080657
polarizability: 2.00914574e+02 4.17736089e+00 6.54506094e+01 -1.07182043e+01 -5.04924641e-01 6.58615907e+01
1716.lowfreq: -13.3297 -7.9830 -2.2651 -0.0006 -0.0006 -0.0005 6.9945 52.0857 56.2790
frequency: -11.0458 52.0662 56.1672 91.5010 135.7404 173.6208 218.8849 223.9360 290.4795 305.1035 318.4056 408.8201 454.2783 491.0489 510.6251 618.7789 734.8658 776.2348 857.0489 857.5039 904.5515 1010.7760 1050.8637 1062.2785 1077.2845 1090.1009 1092.0553 1224.5391 1248.8974 1255.5790 1281.3264 1284.0340 1322.3382 1341.8590 1389.5016 1391.6413 1452.4429 1457.8272 1472.9229 1473.6327 1477.2603 1485.0032 1485.2631 2175.2476 2300.1538 2956.8094 2968.5616 2974.3328 2991.2872 2998.2932 3001.1872 3013.0267 3046.9237 3076.4434 3077.4465 3090.8256 3100.4232
redmass: 2.2797 3.0176 2.4559 2.9617 2.7407 3.5013 1.1002 1.4669 2.9350 3.1909 3.4378 5.4784 6.2221 9.4381 7.4419 3.9136 1.1064 1.1794 1.9052 1.3820 2.4194 3.1249 2.8380 1.7938 1.4466 2.0773 1.4110 1.3151 1.1476 1.5760 1.0890 1.6278 1.8620 1.8147 1.1964 1.2134 1.0851 1.0780 1.0416 1.0545 1.0424 1.0549 1.0767 11.7780 11.8578 1.0581 1.0586 1.0359 1.0350 1.0605 1.0993 1.1002 1.1015 1.1024 1.0991 1.1004 1.1015
irintensity: 0.0539 2.2004 2.1962 1.5266 2.4816 1.6858 0.0108 0.2171 0.4346 1.0486 1.6352 4.4632 3.0348 0.0784 1.8100 0.8784 8.7346 7.4300 5.6681 2.1022 4.8103 0.7172 5.4612 6.2281 0.4085 16.7224 0.9804 0.0179 0.4612 2.2503 0.3354 15.9394 16.4040 1.5957 7.8464 11.6597 3.0970 7.5645 12.1055 4.0834 13.6628 9.0632 14.8698 4.8175 0.5055 31.1306 34.5805 43.7681 46.7624 25.9839 7.6158 9.9929 0.6748 78.1295 45.9798 46.1941 34.2310
temp: 298.150 k
press: 1.00000 atm
elementType: 6 6 6 6 6 6 6 6 6 1 1 1 1 1 1 1 1 1 1 1 1
symmnumber: 1
zpe: 464617.9 jmol-1
zpe.correction: 0.176964 hartree
zpe.thermalcorrener: 0.187608 hartree
zpe.thermalcorrenthalpy: 0.188552 hartree
zpe.thermalcorrgfe: 0.140199 hartree
zpe.sumelectzpe: -349.368747 hartree
zpe.sumelectthermal: -349.358103 hartree
zpe.sumelectthermalent: -349.357158 hartree
zpe.sumelectthermalfe: -349.405512 hartree
dipole: -0.1103 0.2385 -0.0374
dipole: 0.2654
quadrupole: -37.0040 -55.4932 -55.1731
quadrupole: 0.6516 -1.9782 -0.1079
quadrupole: 12.2195 -6.2698 -5.9497 0.6516 -1.9782 -0.1079
hfenergy: -349.5457106 hartree
pointgroup: C01[X(C9H12)]
dipole: 0.0442662 0.0930557 0.016947 debye
dipolederiv: 0.0383886 0.0173886 0.0249669 0.2044215 0.1408845 -0.0303104 0.1898277 -0.016899 0.1310909 0.0477638 -0.0411391 -0.0227985 -0.0966808 0.1200937 -0.0488183 -0.0802543 -0.0570116 0.1453961 -0.1084213 -0.0183403 -0.0000969 -0.1122929 0.0656387 -0.0233374 -0.0810852 -0.0299135 0.081363 0.1890882 -0.0124535 -0.0402628 -0.0930534 -0.1472068 -0.0065452 -0.0991259 -0.0103908 -0.1363917 0.1679285 0.0159587 -0.0132064 0.036974 0.137139 0.0357919 -0.046345 0.0438387 0.1326674 -0.0295606 0.03049 -0.017345 -0.0767071 0.0625542 0.0333191 0.1173777 0.0133808 0.0437041 0.1222687 -0.0201052 -0.0377315 0.0312047 -0.1577837 0.0186131 -0.0883759 0.0251747 -0.1536562 -0.0914622 -0.0280563 -0.0270865 0.0205076 -0.0476892 -0.006158 0.012868 -0.0020823 -0.0431046 -0.0296864 0.0216191 -0.024652 -0.0111552 -0.0368039 0.0074736 0.0107055 0.0011867 -0.0350671 0.04088 -0.019883 0.0596086 -0.0195594 0.0690578 0.031376 0.0363084 0.003268 -0.1546831 0.0268499 0.0750896 -0.0272109 0.0492727 -0.1375481 0.0266433 -0.0269251 0.052627 0.0651273 -0.0701261 -0.0029456 0.0732872 -0.0381044 0.0948061 0.0332327 0.0715392 -0.0015597 -0.1137011 -0.0889163 0.0827121 -0.0027608 0.0700653 -0.0937253 0.0180053 -0.0335997 0.0496779 0.0909624 -0.0818816 -0.0892338 -0.0639513 -0.124865 -0.0189002 -0.0980108 -0.0938323 -0.1004405 0.0237453 0.05522 0.0010291 0.0299904 0.0109006 0.0909008 0.0345706 0.1075077 0.0421573 -0.1670284 0.0424366 0.0506413 -0.0058523 0.1294436 -0.1396165 0.0645653 -0.006374 0.0636502 0.0769351 -0.1056312 -0.060239 0.0062254 -0.0710634 -0.0990498 0.0189509 -0.028869 -0.0048842 0.1048654 -0.0695599 0.0311869 0.0416565 0.0714299 0.0855809 -0.0626499 0.0557567 -0.0354029 -0.1136142 0.1199589 0.0243683 0.0406992 0.008113 0.0576645 -0.0742834 -0.0107106 -0.0417616 -0.1321858 -0.2698422 0.0422893 0.0263743 0.0554497 0.0808336 0.0216692 0.0150013 0.0228621 0.0747142 0.0943046 -0.1003772 -0.0198539 -0.044301 -0.1268306 0.0059025 -0.0213952 -0.0174772 0.078861 unknown
polarizability: 200.939651|-5.348894|65.5252814|-10.0139163|0.5760533|65.7618413 unknown
InChI: InChI=1S/C9H12/c1-3-5-7-9-8-6-4-2/h3-5H2,1-2H3
charge 0 multiplicity 1
21 atoms
C  3.512162 0.610268 0.37806
C  2.719765 -0.431849 -0.46616
C  5.033348 0.491654 0.152287
C  1.264527 -0.359402 -0.270482
C  -4.001244 -0.040257 0.491469
C  -4.690649 0.917021 -0.519811
C  -2.546307 -0.137894 0.295374
C  0.03761 -0.285799 -0.088781
C  -1.319259 -0.206621 0.112629
H  3.271435 0.461402 1.447443
H  3.163477 1.625835 0.112138
H  2.957444 -0.282649 -1.539681
H  3.076889 -1.45063 -0.209163
H  5.583414 1.235051 0.756911
H  5.295322 0.660326 -0.909443
H  5.402261 -0.51248 0.434859
H  -4.450285 -1.050388 0.406951
H  -4.208199 0.304433 1.524651
H  -4.530218 0.57276 -1.555946
H  -5.778116 0.95555 -0.327779
H  -4.283174 1.938766 -0.431229
