program: Gaussian 09
title: 000185901
version: EM64L-G09RevD.01
frameworkgroup: C1[X(C8H12NO3P)]
method: RPBEPBE
basis: SDD
operation: Freq
keyword: #p
keyword: freq=noraman
keyword: PBEPBE/SDD
title: #p freq=noraman PBEPBE/SDD
converged: YES YES NO NO
title: Mulliken charges:
elementType: P O O O N C C C C C C C C H H H H H H H H H H H H
charge: 1.389276 -0.483288 -0.548577 -0.580139 -0.898770 0.553766 -0.415714 -0.361069 -0.192374 -0.214659 -0.262043 -0.489943 -0.480865 0.361651 0.221963 0.270975 0.225396 0.227921 0.229767 0.243976 0.243141 0.233754 0.238234 0.255101 0.232522
chargesum: 0.00000
title: Mulliken charges with hydrogens summed into heavy atoms:
elementType: P O O O N C C C C C C C C
charge: 1.389276 -0.483288 -0.548577 -0.580139 -0.537120 0.553766 -0.193750 -0.090094 0.033022 0.013261 -0.032277 0.230928 0.244992
polarizability: 1.71659885e+02 -5.08382912e+00 1.05276405e+02 7.17253761e-01 1.49319934e+01 9.72845619e+01
1716.lowfreq: -13.3518 -6.2254 -0.0021 -0.0011 -0.0009 4.0062 23.7402 35.4596 60.4898
frequency: 23.4608 35.0600 60.4770 64.3796 74.0685 81.8818 109.4092 162.5884 169.7117 197.2186 255.2722 266.7227 291.2786 337.0499 395.9592 404.8852 468.8714 487.7911 523.8833 568.8204 604.4294 617.3559 674.2910 689.5349 759.0791 773.0504 823.4557 879.5956 890.8819 961.1109 965.4346 979.5727 982.7640 984.4209 1027.4292 1070.6382 1090.3880 1111.7470 1118.8357 1126.1859 1137.4453 1171.6194 1194.5610 1246.9675 1317.7755 1360.6241 1400.1558 1423.5219 1430.5667 1456.3306 1459.9240 1463.4420 1469.7979 1475.8501 1490.0291 1596.4287 1618.0110 2983.2484 2988.6026 3084.0780 3090.6072 3118.3824 3127.1105 3129.8493 3130.2346 3140.8064 3149.8471 3169.2597 3554.3483
redmass: 3.9855 3.6826 2.7381 1.2140 1.0761 3.8641 3.3770 4.3165 4.6618 4.9500 5.1652 6.2186 5.2140 7.0445 3.9655 3.7180 6.0293 1.4847 2.2107 6.8509 6.8259 7.0282 8.7073 1.9263 1.8304 5.5255 1.2635 4.4615 1.5531 1.3748 11.1467 10.5412 2.0697 2.2725 2.1393 11.5219 1.6017 1.2472 1.2445 1.2906 1.3236 1.0494 1.1129 1.7524 1.8022 1.7800 3.2936 1.1233 1.1291 1.0535 1.0523 2.0521 1.0697 1.0564 2.4428 5.9791 6.1297 1.0295 1.0296 1.1053 1.1055 1.0873 1.1029 1.1037 1.0866 1.0920 1.0961 1.1014 1.0757
irintensity: 0.4384 1.3923 5.4707 1.1607 0.0641 0.8014 3.0940 4.0052 16.4543 0.4407 16.2897 7.6706 2.5720 16.5744 3.0919 6.5901 49.9628 76.3518 6.4539 13.0491 44.7486 58.9247 121.4315 40.5879 64.2932 83.6869 0.9773 140.5962 24.2918 0.2464 147.0504 257.0252 0.7225 1.6547 8.3022 127.4523 24.9450 0.7878 0.8082 0.4695 0.7608 1.0115 4.2604 22.3072 122.3420 71.3003 30.9241 2.5142 3.9920 4.2390 15.1826 9.4707 11.1803 15.2416 152.2079 5.9220 129.5599 42.9358 56.8694 30.8059 27.7435 10.7268 12.6804 14.4751 2.1484 17.9710 26.0051 17.7912 45.0670
temp: 298.150 k
press: 1.00000 atm
elementType: 15 8 8 8 7 6 6 6 6 6 6 6 6 1 1 1 1 1 1 1 1 1 1 1 1
symmnumber: 1
zpe: 505352.9 jmol-1
zpe.correction: 0.192479 hartree
zpe.thermalcorrener: 0.207413 hartree
zpe.thermalcorrenthalpy: 0.208358 hartree
zpe.thermalcorrgfe: 0.148184 hartree
zpe.sumelectzpe: -932.683239 hartree
zpe.sumelectthermal: -932.668304 hartree
zpe.sumelectthermalent: -932.667360 hartree
zpe.sumelectthermalfe: -932.727533 hartree
dipole: 0.4548 -1.0512 -4.2402
dipole: 4.3922
quadrupole: -70.1747 -80.2004 -89.8896
quadrupole: -3.5294 -4.9295 0.5272
quadrupole: 9.9135 -0.1121 -9.8014 -3.5294 -4.9295 0.5272
hfenergy: -932.8757177 hartree
pointgroup: C01 [X(C8H12N1O3P1)]
dipole: 0.2507711 -0.3757669 -1.6679166 debye
dipolederiv: 2.800697 -0.1419428 0.0514674 0.1418654 1.8631214 -0.4887262 0.2666848 -0.1246643 1.5794043 -0.705281 -0.0175405 0.0129186 -0.1519691 -0.813112 0.4346384 0.055408 0.4369278 -0.9496122 -1.4822524 0.3997345 -0.0676512 0.4486047 -0.7517669 0.0861309 0.0725206 -0.0390419 -0.5529952 -0.7967207 0.0337288 -0.0215256 -0.026005 -0.5918522 0.0590537 -0.0636886 0.0298414 -0.6580098 -2.0520049 0.1574358 -0.0346838 0.1191567 -0.5866288 0.1485972 -0.178799 0.0785207 -0.5816552 1.5607054 -0.2548315 0.0139727 -0.6548468 0.151976 -0.0643404 -0.2470846 -0.0302129 0.0578296 -0.4678212 0.0732594 0.0291472 -0.0798725 -0.0391808 0.1250686 -0.1051226 0.1537939 -0.1071211 -0.2437259 0.0124263 0.008214 0.3364747 -0.1494653 0.0762208 0.2845867 0.03513 -0.1103601 0.156957 -0.054918 0.0138395 -0.0161007 0.0371376 0.1305256 0.0476255 0.1235553 -0.0117061 0.1585419 0.008591 0.0573849 -0.090131 0.0448411 0.1300017 -0.0150112 0.1503465 0.0004454 -0.0827998 -0.0667471 -0.0190498 -0.0366368 -0.1871127 0.0065961 -0.0111529 -0.0006666 -0.2035687 0.3082284 -0.025142 0.0043762 0.0235514 0.2032122 -0.0499519 -0.1267483 -0.321574 0.592173 0.8392079 -0.2336177 0.0527361 -0.075505 0.278965 -0.0209554 0.2895929 -0.1557696 0.2117219 0.1243958 -0.0406121 -0.0496137 0.0249977 0.2211138 -0.0619542 -0.0793249 -0.074302 0.2564785 0.063926 0.0785503 0.0416212 0.060574 -0.0053852 -0.1262573 0.026213 -0.1245095 0.0672065 0.0040084 -0.0349838 -0.0677063 -0.0497572 0.1036983 -0.0471513 -0.0879835 -0.0504638 0.1016045 -0.037453 -0.0620033 -0.0884072 -0.0672645 0.0678001 -0.0850492 -0.0977434 -0.0841548 0.0654035 0.0714572 0.0347838 0.0135435 0.0569188 -0.006724 -0.1219216 0.0299671 -0.1242807 0.0516057 -0.1131575 0.0710741 0.002366 0.0743891 0.0994701 -0.0440004 0.0022091 -0.0444907 0.1348809 0.1059338 -0.0264006 0.0085821 -0.0489265 -0.1095283 0.0567206 0.0036025 0.0564143 0.0408233 -0.0788164 -0.0163854 -0.1024965 -0.0339209 0.0868062 -0.043136 -0.0678472 0.0336995 -0.0179415 -0.0415938 0.0542332 0.0956773 0.1025037 0.0587658 -0.071921 0.0803915 0.0241323 -0.0404461 -0.0175964 0.0936539 0.0072671 0.1000722 -0.0285593 -0.0816969 0.0296759 -0.0926076 0.0618987 0.0341455 -0.0005907 0.0456497 -0.0108721 0.0993651 0.0337636 -0.0700589 0.0992511 -0.0748614 -0.108981 -0.0417557 -0.0076292 -0.1473003 -0.0469571 0.0197447 -0.0379126 0.0451257 0.0868015 unknown
polarizability: 168.8537319|-13.8933201|106.4084735|7.2063791|14.0730183|98.9586461 unknown
InChI: InChI=1S/C8H12NO3P/c1-11-13(10,12-2)9-8-6-4-3-5-7-8/h3-7,9H,1-2H3
charge 0 multiplicity 1
25 atoms
P  1.582084 -0.336782 0.48367
O  1.834485 1.28936 -0.058517
O  2.698261 -1.351742 -0.379817
O  1.667573 -0.387308 2.064818
N  0.19312 -0.928514 -0.37167
C  -1.141523 -0.458553 -0.25021
C  -2.16494 -1.101585 -0.996736
C  -1.470574 0.636683 0.592513
C  -3.498175 -0.651033 -0.900925
C  -2.808411 1.075741 0.676817
C  -3.830576 0.440756 -0.066093
C  1.780826 1.587161 -1.508549
C  3.989414 -1.666998 0.274168
H  0.360377 -1.764758 -0.935767
H  -1.917125 -1.95088 -1.645615
H  -0.695855 1.134452 1.18646
H  -4.27845 -1.157737 -1.48005
H  -3.051357 1.918449 1.333596
H  -4.866604 0.786702 0.00777
H  1.932638 2.675018 -1.571351
H  0.797588 1.315648 -1.933055
H  2.586264 1.056186 -2.047058
H  4.38777 -2.526408 -0.28516
H  3.836698 -1.931708 1.335359
H  4.680689 -0.809151 0.197403
