program: Gaussian 09
title: 000186064
version: EM64L-G09RevD.01
frameworkgroup: C1[X(C19H23NO10S)]
method: RPBEPBE
basis: SDD
operation: Freq
keyword: #p
keyword: freq=noraman
keyword: PBEPBE/SDD
title: #p freq=noraman PBEPBE/SDD
converged: NO YES NO NO
title: Mulliken charges:
elementType: S O O O O O O O O O O N C C C C C C C C C C C C C C C C C C C H H H H H H H H H H H H H H H H H H H H H H H
charge: -0.016557 -0.213029 -0.273108 -0.270035 -0.264134 -0.191079 -0.254745 -0.226222 -0.251580 -0.232994 -0.250899 -0.030702 -0.114490 -0.003968 -0.097233 -0.175833 -0.097609 -0.368542 0.304817 0.297977 0.320894 -0.759175 -0.754674 0.322982 -0.766256 -0.307354 -0.128910 -0.770378 -0.143847 -0.209946 -0.171408 0.313021 0.290915 0.293061 0.300125 0.310885 0.236221 0.274009 0.251156 0.257245 0.246994 0.255204 0.258906 0.246096 0.239718 0.278318 0.249840 0.260804 0.266950 0.244378 0.239868 0.293856 0.243878 0.246592
chargesum: 0.00000
title: Mulliken charges with hydrogens summed into heavy atoms:
elementType: S O O O O O O O O O O N C C C C C C C C C C C C C C C C C C C
charge: -0.016557 -0.213029 -0.273108 -0.270035 -0.264134 -0.191079 -0.254745 -0.226222 -0.251580 -0.232994 -0.250899 -0.030702 0.198531 0.286947 0.195828 0.124292 0.213276 0.141689 0.304817 0.297977 0.320894 -0.003780 0.005532 0.322982 0.001620 -0.307354 0.131894 0.007224 0.123103 0.034432 0.075184
polarizability: 2.93530257e+02 4.66912024e+00 3.16219887e+02 1.45013720e+01 7.55155912e-01 1.91334624e+02
1716.lowfreq: -3.3988 -1.3242 -0.0016 -0.0005 0.0003 6.5550 17.2853 21.1735 24.1760
frequency: 17.2348 21.1684 24.1095 26.5732 31.4216 36.1929 40.7926 45.0491 48.0766 51.2127 59.1910 67.3104 77.9458 82.9020 88.2653 92.3714 98.3485 108.0370 110.8876 120.7679 130.2936 149.4321 174.4635 182.5173 197.9269 212.4510 229.6935 245.9144 258.9254 270.9729 277.4690 294.0363 339.8972 343.2837 373.5320 381.8716 406.1991 409.2975 444.0751 460.5559 483.3941 489.4821 493.1306 498.9088 524.4883 537.1242 549.2377 556.6301 564.0788 566.1836 575.4330 601.9612 619.2231 625.6466 634.0468 648.8952 675.8841 685.0611 706.7415 738.7114 770.4314 784.5145 800.0396 811.3393 833.6575 836.6392 847.0194 854.2756 923.2506 924.9856 952.6608 969.4439 972.0433 985.7813 989.7593 995.0031 1001.1333 1006.6784 1014.9151 1017.5429 1023.4532 1041.1419 1044.0704 1044.4048 1051.6631 1057.3147 1062.0213 1072.8635 1078.5574 1097.9834 1122.8885 1144.6187 1147.5313 1159.6956 1176.7735 1187.9759 1188.2170 1208.0367 1224.1246 1229.2854 1240.7799 1255.7021 1281.2818 1291.0655 1299.9731 1304.4015 1311.9184 1338.2693 1347.7133 1351.9187 1359.3355 1370.1701 1382.3788 1383.6755 1384.4928 1387.6394 1393.6477 1437.1234 1450.2197 1451.1917 1451.5465 1452.7496 1453.3009 1453.5612 1454.8946 1455.4446 1461.8869 1536.2689 1601.3717 1648.4132 1659.3700 1673.2031 1676.8329 3002.7468 3008.9364 3009.0829 3009.1805 3019.3148 3037.9161 3039.9718 3049.1306 3081.4946 3083.8261 3097.1100 3097.3268 3099.2296 3103.8812 3128.6562 3142.7513 3143.6540 3144.7105 3145.3194 3153.6943 3185.3312 3191.3514 3222.5513
redmass: 6.3516 7.7515 6.9618 6.2172 5.0469 1.2904 3.4448 2.0371 5.4709 5.2386 4.4446 2.9583 2.4766 3.2129 5.9961 4.6004 4.1552 1.5996 1.4649 1.7149 2.7167 5.8449 8.5459 8.1565 5.7375 5.9524 5.1713 6.1671 8.2832 6.7821 6.7548 3.0181 5.7674 4.4545 4.1991 4.7355 4.2080 4.2790 4.4951 4.2134 4.1504 3.6605 6.1988 4.1474 4.1825 4.6221 3.6475 3.2959 3.8570 3.3855 4.9335 5.6621 5.6175 4.8465 4.8343 4.8656 4.8949 6.2659 4.2579 1.3022 4.1917 6.4346 7.2995 5.8769 5.4018 1.3405 5.5750 3.5428 2.3317 1.8617 5.4686 3.6680 3.3876 1.3280 2.0693 2.1210 2.6047 3.1604 3.4240 2.7523 5.3563 1.6632 1.6790 1.6721 1.6539 3.9786 3.6962 3.9739 4.6558 3.7026 2.9900 2.5208 1.3354 1.8492 3.0085 3.2186 3.1725 3.4079 1.2572 1.5308 1.3210 1.3226 1.1668 2.1947 1.2359 1.2459 1.3223 1.2486 1.3761 1.3248 1.2665 1.3901 1.2489 1.2476 1.2484 1.2606 2.0436 2.2031 1.0563 1.0562 1.0545 1.0578 1.0542 1.0487 1.0549 1.0990 1.0559 7.2020 5.6768 9.4521 9.2381 9.6991 10.0490 1.0384 1.0367 1.0375 1.0368 1.0834 1.0608 1.0835 1.0842 1.0864 1.0900 1.0968 1.0941 1.0959 1.0959 1.1044 1.1020 1.1024 1.1017 1.1012 1.0892 1.0921 1.0957 1.0982
irintensity: 0.2436 2.9886 0.1896 0.4272 1.6054 1.7070 0.7269 2.8075 1.3132 0.2633 0.8788 2.0186 1.7359 1.4474 9.1241 1.5226 1.8008 1.2529 1.7190 0.0610 1.4096 2.6212 2.2160 1.8076 14.6797 6.8010 5.6510 2.2204 1.0438 2.1594 3.7068 11.2832 5.8747 3.3910 26.1078 2.4755 2.0584 10.8267 12.1142 2.9866 26.2297 10.0548 19.3954 3.2421 2.2739 6.5657 8.7776 9.1683 0.7344 0.9139 6.4188 16.3312 5.4487 4.7771 4.9447 2.7071 2.9628 10.1616 13.3928 60.2127 31.8024 111.5976 116.5819 28.7392 41.9532 5.4826 106.0392 24.5854 16.0655 12.0817 71.0596 11.4651 96.2545 0.5085 51.9139 99.8501 271.8383 56.1531 46.8143 17.0561 7.5931 19.9018 24.4869 6.0309 25.0777 22.3590 14.9611 60.5720 73.0368 6.4820 19.7415 26.9167 14.7342 12.0635 215.9476 618.6793 51.2294 338.2224 12.2159 3.4575 40.1269 26.5318 12.3006 41.2120 3.2646 16.2744 0.3376 0.4567 4.5623 2.5352 9.7830 4.2033 88.3394 59.5719 82.6961 56.0894 36.7959 37.4803 13.3623 23.1468 16.9055 23.5430 11.9165 24.4751 17.0797 13.3226 24.3563 77.3553 49.1633 177.0715 141.6423 26.7466 307.8839 4.1025 6.8070 0.4407 1.2607 28.9619 38.7227 4.0939 6.9543 1.6330 10.4680 5.0536 3.2717 4.7735 3.0164 4.6272 8.4766 9.1298 8.5750 9.5103 11.6577 1.9443 2.1442 3.5671
temp: 298.150 k
press: 1.00000 atm
elementType: 16 8 8 8 8 8 8 8 8 8 8 7 6 6 6 6 6 6 6 6 6 6 6 6 6 6 6 6 6 6 6 1 1 1 1 1 1 1 1 1 1 1 1 1 1 1 1 1 1 1 1 1 1 1
symmnumber: 1
zpe: 1062628.3 jmol-1
zpe.correction: 0.404734 hartree
zpe.thermalcorrener: 0.437973 hartree
zpe.thermalcorrenthalpy: 0.438917 hartree
zpe.thermalcorrgfe: 0.333671 hartree
zpe.sumelectzpe: -1940.491539 hartree
zpe.sumelectthermal: -1940.458300 hartree
zpe.sumelectthermalent: -1940.457356 hartree
zpe.sumelectthermalfe: -1940.562602 hartree
dipole: -2.4153 -2.1427 0.0665
dipole: 3.2294
quadrupole: -172.7536 -175.4699 -193.8131
quadrupole: -20.9090 3.0957 -4.3091
quadrupole: 7.9253 5.2089 -13.1342 -20.9090 3.0957 -4.3091
hfenergy: -1940.8962728 hartree
pointgroup: C01 [X(C19H23N1O10S1)]
dipole: 0.3513523 1.021862 -0.6683071 debye
polarizability: 308.3426154|6.8783313|282.6475018|-11.2780481|-43.4496024|210.0946507 unknown
InChI: InChI=1S/C19H23NO10S/c1-10(21)25-9-14-16(26-11(2)22)17(27-12(3)23)18(28-13(4)24)19(29-14)30-20-8-6-5-7-15(20)31/h5-8,14,16-19H,9H2,1-4H3
charge 0 multiplicity 1
54 atoms
S  1.013659 -4.202284 1.846531
O  1.08033 -0.522503 -0.911389
O  -2.808626 0.644574 0.134574
O  -1.204694 1.167391 -2.5139
O  -1.651766 -1.764041 1.189342
O  1.417712 -1.166013 1.416027
O  1.115171 3.159575 0.032315
O  -4.158196 -0.77532 -1.154474
O  -0.717295 3.441956 -2.687873
O  -1.561708 -0.940313 3.379947
O  2.826113 3.367011 -1.537864
N  2.585432 -1.997065 1.244803
C  -1.58149 0.042776 -0.429886
C  -0.761867 1.163754 -1.087918
C  -0.82446 -0.644013 0.720066
C  0.766775 0.929087 -0.998103
C  0.508428 -1.228457 0.20634
C  1.440741 1.721069 0.153113
C  -4.052316 0.120648 -0.295517
C  -1.14052 2.385143 -3.207215
C  -1.892065 -1.843377 2.587896
C  -5.171085 0.81917 0.440943
C  -1.630809 2.2061 -4.624229
C  1.88471 3.89027 -0.902737
C  -2.560747 -3.153316 2.908849
C  2.48667 -3.393611 1.477528
C  3.747488 -1.30972 0.954348
C  1.379924 5.304295 -1.004913
C  3.76341 -4.066964 1.369642
C  4.95333 -1.986791 0.8629
C  4.951844 -3.404183 1.07608
H  -1.866399 -0.706649 -1.19194
H  -1.002333 2.146723 -0.643478
H  -0.658518 0.048039 1.568489
H  1.237964 1.234893 -1.945498
H  0.412337 -2.285137 -0.089909
H  2.533937 1.585794 0.086438
H  1.076691 1.440151 1.151533
H  -5.099764 1.910801 0.297017
H  -5.084273 0.627163 1.52458
H  -6.141252 0.454369 0.075095
H  -0.888006 1.629547 -5.204302
H  -2.572792 1.633857 -4.63764
H  -1.771737 3.189201 -5.095773
H  -3.036137 -3.102664 3.899178
H  -1.780371 -3.936804 2.919499
H  -3.294995 -3.423064 2.133142
H  3.634274 -0.235164 0.815513
H  3.739079 -5.145689 1.541826
H  5.86567 -1.433861 0.630808
H  2.141916 5.942921 -1.474866
H  0.47311 5.291401 -1.636148
H  1.101694 5.697544 -0.014187
H  5.888211 -3.967522 1.011492
