program: Gaussian 09
title: 000186050
version: EM64L-G09RevD.01
frameworkgroup: C1[X(C24H28N2O6)]
method: RPBEPBE
basis: SDD
operation: Freq
keyword: #p
keyword: freq=noraman
keyword: PBEPBE/SDD
title: #p freq=noraman PBEPBE/SDD
converged: YES YES NO NO
title: Mulliken charges:
elementType: O O O O O O N N C C C C C C C C C C C C C C C C C C C C C C C C H H H H H H H H H H H H H H H H H H H H H H H H H H H H
charge: -0.305782 -0.272727 -0.277145 -0.254967 -0.275113 -0.282005 -0.233795 -0.118730 0.407494 -0.155765 -0.105567 -0.247005 0.142364 -0.224093 -0.115896 -0.617813 -0.514477 0.232102 -0.537230 -0.325809 0.210637 -0.580476 0.237779 -0.390480 0.105917 -0.541246 -0.482207 -0.632697 0.208853 0.227478 -0.536323 -0.521609 0.232982 0.243576 0.262265 0.229133 0.237416 0.241226 0.240078 0.231555 0.236769 0.248326 0.243582 0.208053 0.226250 0.267396 0.252695 0.225248 0.231909 0.290159 0.326044 0.213329 0.252916 0.248621 0.229249 0.223217 0.240178 0.228232 0.210476 0.255450
chargesum: 0.00000
title: Mulliken charges with hydrogens summed into heavy atoms:
elementType: O O O O O O N N C C C C C C C C C C C C C C C C C C C C C C C C
charge: -0.305782 -0.272727 -0.277145 -0.254967 -0.275113 -0.282005 -0.233795 -0.118730 0.407494 0.077218 0.138009 0.015260 0.142364 0.005041 0.121520 -0.136509 -0.046153 0.232102 -0.045322 0.108494 0.210637 -0.060385 0.237779 0.066677 0.105917 -0.251087 -0.156164 0.082169 0.208853 0.227478 0.156321 0.172550
polarizability: 3.78394693e+02 7.32581870e+00 3.05373899e+02 -1.32152969e+01 1.50490337e+00 1.91556035e+02
1716.lowfreq: -8.9823 -0.0006 0.0004 0.0009 5.2110 10.2023 32.1087 40.8155 56.2448
frequency: 31.8102 40.7959 56.2011 69.2907 77.5124 94.2473 100.4875 108.9437 121.3570 146.5357 159.9951 164.2982 171.7792 181.4034 193.6138 208.5374 218.4454 227.0231 235.6465 259.9128 264.1375 277.6084 283.3792 291.4855 297.8755 310.5983 316.4996 326.5723 350.1281 353.1530 365.2035 380.6643 393.9553 406.7293 419.3846 427.8869 435.0033 451.6239 466.1268 483.6039 491.0476 512.8368 524.4979 553.2225 562.3418 564.3815 595.9684 614.8219 624.5387 631.7918 653.2973 663.9006 684.7374 694.3834 719.5737 741.0288 749.2319 760.9162 773.3984 793.0695 815.3624 827.5412 843.2526 863.4041 872.0555 892.0683 907.0375 921.0160 930.0547 939.7679 959.5109 970.6045 973.9729 981.9092 988.6100 1010.6332 1017.9297 1022.8915 1035.3311 1048.9577 1063.7486 1070.5577 1078.2647 1087.5627 1096.5943 1104.4810 1110.2858 1112.2672 1113.3129 1119.0298 1122.0952 1146.1093 1156.5269 1159.2454 1169.2749 1172.6539 1175.4843 1179.9002 1196.6151 1203.6830 1219.9435 1226.4511 1233.8601 1236.3801 1244.4567 1260.5378 1267.6440 1274.7599 1283.5567 1291.0953 1296.0879 1301.8200 1310.2175 1316.5345 1324.0395 1324.2326 1337.8343 1353.4516 1354.3436 1361.2442 1369.0126 1372.5265 1381.0646 1391.5455 1401.2218 1413.9554 1435.5890 1436.4021 1446.2420 1447.8648 1448.3197 1455.1616 1455.7219 1457.0323 1459.7260 1465.4190 1468.9255 1473.0572 1475.8906 1481.0155 1481.2319 1490.5010 1541.9559 1581.2028 1601.0533 1615.0358 2908.2109 2937.8457 2938.3271 2948.0452 2954.0468 2961.8266 2971.7763 2972.6200 2975.9448 2987.2751 2989.6804 3002.5120 3003.7520 3030.0278 3034.7139 3050.3964 3051.3167 3059.0398 3060.9726 3066.7587 3079.4997 3079.5616 3091.6322 3109.6938 3122.3560 3123.8976 3175.0355 3206.6380
redmass: 4.8908 3.7864 2.8371 3.1361 5.0592 3.5506 3.6020 4.5773 1.0984 1.7860 4.3529 3.8068 3.3442 2.4846 5.1918 4.0480 1.8979 5.0636 4.5842 3.2685 3.8875 2.6446 3.2178 3.9231 3.9385 3.7149 3.6161 3.0920 3.7650 2.8915 4.2752 3.8731 4.7477 4.7826 4.7012 4.3359 3.6570 3.8689 3.8177 3.9534 4.9740 4.9974 3.6179 3.7954 4.0171 4.1108 4.1730 4.5636 4.6913 5.2711 4.1385 4.4668 4.6952 7.4650 5.5108 3.5180 4.5164 2.7789 3.4300 4.2337 4.4112 5.7046 3.6857 2.0129 1.9307 2.8948 1.4266 2.4839 2.3989 4.2403 3.4528 2.3330 2.5254 5.8497 2.8413 3.4330 2.5444 2.1113 3.1100 1.8661 2.2751 2.9661 1.9670 2.3195 2.3133 3.4487 1.2474 1.2592 2.6681 2.3349 2.5508 1.7158 1.5036 2.0792 1.9588 2.4552 2.8124 2.4555 1.2671 1.4586 1.4564 1.3033 1.3952 1.3416 1.5355 1.7427 1.6973 2.1550 1.8075 2.0220 1.4289 1.5284 1.3879 1.5297 1.3784 1.4114 1.3730 1.4736 1.3865 1.4484 1.7348 1.4289 2.6946 3.7335 2.3118 2.8567 1.2724 1.2537 1.1238 1.3923 1.1418 1.0972 1.0848 1.0832 1.0682 1.0499 1.0754 1.1860 1.0703 1.0711 1.0730 2.6417 7.6185 9.5039 10.3008 7.8752 1.0703 1.0830 1.0499 1.0653 1.0837 1.0325 1.0697 1.0344 1.0634 1.0799 1.0841 1.0656 1.0606 1.0895 1.0949 1.1040 1.0946 1.0925 1.0861 1.1025 1.0979 1.0978 1.0955 1.0988 1.1000 1.1042 1.0908 1.0932
irintensity: 0.5986 1.5447 8.5297 1.0866 1.7407 1.7010 3.0937 5.8928 0.2473 1.3900 0.1596 1.8412 2.2221 2.8077 3.2978 0.5375 1.1691 1.8685 4.3358 3.3381 1.7664 0.7461 2.8351 22.6890 31.8720 0.2690 0.5393 1.2654 5.4757 2.8032 13.8396 9.1658 7.4902 7.5657 8.2771 3.3658 2.5944 7.2827 12.0095 18.6640 26.6527 4.8516 3.7814 14.2840 0.8038 12.8327 3.9614 3.4049 0.2580 0.0868 2.3676 2.2467 21.5199 3.3515 25.1101 3.3193 18.3953 7.8386 4.8343 22.4202 7.0834 2.4663 20.0551 7.2393 6.4097 2.1242 31.5444 2.2846 8.4639 27.5739 14.4503 36.4894 11.7714 49.4370 9.2015 44.7749 34.0571 23.9460 10.8968 9.2687 35.7331 30.1902 14.2472 22.9286 13.7591 37.0000 15.0834 0.2245 5.3709 11.0774 11.5639 10.3499 20.2184 19.8845 15.5940 18.9215 31.3856 122.1275 22.2878 1.8312 18.0926 30.1833 14.7994 4.3997 9.1545 38.5352 4.0429 96.5705 112.6594 4.7096 14.6274 47.1197 13.3302 7.7884 5.6374 1.0201 9.2919 4.4804 0.8674 5.7973 35.7115 6.0416 41.2360 26.1906 97.4102 1.0803 31.5127 4.2368 19.9280 39.5232 5.2788 9.6026 15.7986 21.5909 5.1236 14.6399 6.0819 188.1826 29.5338 36.5587 1.5303 222.4076 98.1922 196.0304 125.3745 35.4562 70.5183 38.6010 74.8005 112.8390 20.6387 64.2424 5.5769 98.0945 43.1932 20.4723 31.0263 2.3601 21.7659 8.2717 14.2222 41.2155 17.6949 6.8462 14.0243 21.6459 58.7891 30.9798 9.6856 14.0720 28.0722 22.1806 3.1470 5.3506
temp: 298.150 k
press: 1.00000 atm
elementType: 8 8 8 8 8 8 7 7 6 6 6 6 6 6 6 6 6 6 6 6 6 6 6 6 6 6 6 6 6 6 6 6 1 1 1 1 1 1 1 1 1 1 1 1 1 1 1 1 1 1 1 1 1 1 1 1 1 1 1 1
symmnumber: 1
zpe: 1275797.1 jmol-1
zpe.correction: 0.485925 hartree
zpe.thermalcorrener: 0.513677 hartree
zpe.thermalcorrenthalpy: 0.514621 hartree
zpe.thermalcorrgfe: 0.430600 hartree
zpe.sumelectzpe: -1489.735325 hartree
zpe.sumelectthermal: -1489.707574 hartree
zpe.sumelectthermalent: -1489.706629 hartree
zpe.sumelectthermalfe: -1489.790650 hartree
dipole: 4.6209 -4.8493 -0.2579
dipole: 6.7034
quadrupole: -184.4023 -193.7784 -183.8056
quadrupole: 16.5712 -14.2488 13.2243
quadrupole: 2.9265 -6.4497 3.5232 16.5712 -14.2488 13.2243
hfenergy: -1490.2212501 hartree
pointgroup: C01 [X(C24H28N2O6)]
dipole: -1.8554097 1.8649739 -0.1864446 debye
polarizability: 377.9781372|9.3587958|305.3929049|13.5122667|-5.992296|191.9535849 unknown
InChI: InChI=1S/C24H28N2O6/c1-25-5-4-23-12-6-15(29-2)16(30-3)8-14(12)26-20(28)9-17-21(22(23)26)13(7-18(23)27)24(11-25)19(32-24)10-31-17/h6,8,13,17,19,21-22H,4-5,7,9-11H2,1-3H3
charge 0 multiplicity 1
60 atoms
O  -5.016089 0.401935 0.974736
O  -3.299885 -2.449098 -0.582801
O  0.141545 2.701207 0.886483
O  1.206508 -3.949116 -0.066495
O  5.024285 1.542387 -0.033717
O  5.39231 -1.262624 -0.186442
N  0.477311 -1.754212 -0.412258
N  -2.215226 2.358561 -0.734802
C  -3.615057 0.55043 0.366341
C  -2.479816 0.017179 1.27353
C  -1.579221 -1.146978 0.757463
C  -0.668648 -0.782579 -0.433575
C  -0.009912 0.646048 -0.440188
C  -4.624526 -0.375856 -0.258927
C  -2.234904 -2.517892 0.445681
C  -1.505522 1.129931 1.743583
C  -3.531474 1.978616 -0.197188
C  -0.509228 1.62529 0.682501
C  -0.260312 1.344191 -1.81457
C  -4.5625 -1.887005 -0.0919
C  1.482784 0.33446 -0.282025
C  -1.209511 -3.532219 -0.138039
C  1.717675 -1.056895 -0.327671
C  -1.760172 1.666908 -1.964267
C  0.262835 -3.107762 -0.189527
C  2.557868 1.231733 -0.168014
C  3.022725 -1.585397 -0.263402
C  -1.974752 3.815014 -0.730695
C  3.879273 0.725219 -0.110695
C  4.108851 -0.688812 -0.154409
C  4.811488 2.991435 -0.043691
C  6.324994 -0.916392 0.905775
H  -3.005729 -0.36885 2.171046
H  -0.897666 -1.348239 1.613324
H  -1.245141 -0.9368 -1.366654
H  -5.120532 -0.013245 -1.171651
H  -2.687084 -2.914839 1.381152
H  -0.906693 0.734402 2.590728
H  -2.03701 2.014693 2.137549
H  -4.351742 2.115223 -0.939753
H  -3.754803 2.666898 0.639543
H  0.089706 0.696095 -2.640132
H  0.340318 2.271539 -1.846596
H  -4.717651 -2.139702 0.977166
H  -5.352512 -2.370925 -0.691017
H  -1.538977 -3.74392 -1.17423
H  -1.238127 -4.491932 0.401721
H  -1.9438 2.282699 -2.871255
H  -2.34432 0.736146 -2.082468
H  2.346898 2.301543 -0.100946
H  3.207713 -2.659795 -0.287733
H  -2.686866 4.359076 -1.389073
H  -0.944295 4.021162 -1.060366
H  -2.05998 4.201379 0.299251
H  4.216239 3.319078 0.830419
H  4.30719 3.313918 -0.975196
H  5.819158 3.430315 0.004579
H  7.228191 -1.512468 0.704068
H  5.895588 -1.207127 1.884423
H  6.56003 0.160464 0.900307
