program: Gaussian 09
title: 000185884
version: EM64L-G09RevD.01
frameworkgroup: C1[X(C16H12O5)]
method: RPBEPBE
basis: SDD
operation: Freq
keyword: #pfreq=noraman
keyword: PBEPBE/SDD
title: #p freq=noraman PBEPBE/SDD
converged: NO YES NO NO
title: Mulliken charges:
elementType: O O O O O C C C C C C C C C C C C C C C C H H H H H H H H H H H H
charge: -0.231522 -0.224500 -0.207340 -0.249357 -0.205371 -0.323506 0.127350 -0.103167 0.097824 0.035342 0.197077 0.270716 -0.510323 0.008798 -0.261200 -0.501333 0.187837 -0.543030 0.043969 -0.115817 -0.529746 0.276262 0.253360 0.251314 0.251427 0.269435 0.250758 0.250885 0.266269 0.260880 0.229618 0.228578 0.248512
chargesum: 0.00000
title: Mulliken charges with hydrogens summed into heavy atoms:
elementType: O O O O O C C C C C C C C C C C C C C C C
charge: -0.231522 -0.224500 -0.207340 -0.249357 -0.205371 -0.047244 0.127350 0.150193 0.097824 0.035342 0.197077 0.270716 -0.007582 0.008798 0.008235 0.000310 0.187837 -0.276761 0.043969 0.145063 0.176961
polarizability: 2.70257535e+02 -2.12417670e+01 2.20424477e+02 2.93248450e+00 9.26567389e-01 1.03451483e+02
1716.lowfreq: -8.7556 -0.0009 -0.0008 -0.0008 3.4287 7.5770 43.9981 64.1594 72.8995
frequency: 43.8687 64.1508 72.8904 89.2329 110.0578 113.6338 130.3382 153.7598 188.1631 195.0191 244.6491 270.3332 284.4096 300.4624 323.2110 338.9612 381.0644 419.1087 439.0808 517.0848 519.8421 539.1611 566.2528 595.1058 602.2255 608.1114 630.9750 636.5654 670.4476 710.7451 726.5753 745.0237 759.3620 777.5708 794.6191 820.7995 829.6254 835.1298 874.4619 883.5364 886.7970 902.5308 917.8807 967.3878 975.8297 988.0422 993.7591 1007.5690 1014.3604 1020.8020 1084.0639 1112.8353 1116.6934 1136.3247 1140.8508 1158.6003 1188.8749 1189.8644 1216.3886 1224.6731 1232.8674 1242.8132 1259.4208 1271.7245 1295.4374 1315.0318 1316.7628 1353.5312 1396.9148 1432.7915 1438.2118 1458.1128 1465.9993 1469.1761 1472.8402 1491.4476 1560.7185 1606.8375 1617.0571 1638.6589 1649.5085 2968.3113 3006.7866 3020.8379 3030.3599 3052.8087 3060.2289 3080.1798 3113.7735 3134.2540 3189.3747 3215.3837 3248.5786
redmass: 5.6437 4.0655 5.9428 4.4348 4.5576 2.9300 3.1114 4.2944 2.5228 3.1475 1.9178 6.0549 5.4409 4.9246 5.2135 5.2615 5.9579 6.3282 5.8397 4.0400 5.0455 6.4547 8.3336 7.3118 4.5693 6.1412 3.9830 5.5410 6.0895 5.1483 1.6152 3.8339 4.1686 6.4507 3.9271 1.6372 6.1574 1.8795 2.8646 3.3495 2.0295 7.7248 3.0938 3.1351 4.9883 5.0204 2.0395 7.4353 2.4547 6.8760 6.3659 1.2580 1.2516 1.1817 2.3483 1.4584 1.1119 1.9380 1.5963 1.7494 1.4358 1.6954 2.1093 1.6721 1.8434 5.8376 1.4589 4.3610 5.6366 1.1040 1.3505 1.2188 1.0514 2.1831 1.5417 3.6695 7.4434 9.2281 6.8183 11.9918 11.0637 1.0326 1.0598 1.0617 1.0856 1.1027 1.1044 1.1021 1.0904 1.1003 1.0914 1.0882 1.1117
irintensity: 0.1395 3.6442 2.2173 3.7261 1.5065 2.1254 4.0222 2.6373 0.9692 2.1052 0.6000 0.9143 0.7945 1.4644 5.5598 12.5128 4.1275 0.7834 10.1319 1.8032 3.9651 10.2757 7.0194 2.7891 5.9594 23.0825 4.9186 8.0396 2.0220 10.3771 46.8901 19.5403 2.3165 27.9922 58.0829 0.8000 3.8430 40.9655 43.7292 158.8839 5.8101 33.6640 65.8274 11.8330 4.3925 24.8663 0.5135 82.1698 34.7347 136.6428 83.0315 0.0328 19.5478 0.1832 44.0981 25.9943 0.2046 50.2011 15.5332 53.9477 0.5068 20.3584 89.0288 17.3551 23.3125 6.8226 7.2512 63.8155 62.0862 13.4448 16.9340 5.1980 15.1426 124.3170 29.5411 85.2227 8.7492 288.6189 178.8655 259.1009 275.8603 64.9303 15.3388 19.4806 9.1211 3.5198 37.7538 14.5064 29.4270 16.9182 2.0325 1.2540 3.8906
temp: 298.150 k
press: 1.00000 atm
elementType: 8 8 8 8 8 6 6 6 6 6 6 6 6 6 6 6 6 6 6 6 6 1 1 1 1 1 1 1 1 1 1 1 1
symmnumber: 1
zpe: 640938.1 jmol-1
zpe.correction: 0.244120 hartree
zpe.thermalcorrener: 0.260869 hartree
zpe.thermalcorrenthalpy: 0.261813 hartree
zpe.thermalcorrgfe: 0.199412 hartree
zpe.sumelectzpe: -991.484041 hartree
zpe.sumelectthermal: -991.467293 hartree
zpe.sumelectthermalent: -991.466349 hartree
zpe.sumelectthermalfe: -991.528750 hartree
dipole: -0.6063 5.3607 0.2381
dipole: 5.4002
quadrupole: -126.9808 -117.4879 -115.0799
quadrupole: 22.9188 3.4853 -1.1734
quadrupole: -7.1313 2.3616 4.7696 22.9188 3.4853 -1.1734
hfenergy: -991.7281617 hartree
pointgroup: C01 [X(C16H12O5)]
dipole: 0.1522823 -2.089593 0.3525151 debye
polarizability: 268.5398199|-22.8027995|220.1186065|4.0206334|-15.5971755|105.4750684 unknown
InChI: InChI=1S/C16H12O5/c1-18-10-6-11-13(8-4-5-19-16(8)20-11)15-12(10)7-2-3-9(17)14(7)21-15/h4-6,8,16H,2-3H2,1H3
charge 0 multiplicity 1
33 atoms
O  3.080095 -1.161065 -0.193728
O  -0.849478 1.662391 -0.461158
O  4.512564 0.662722 0.528337
O  -1.48973 -2.903078 0.617932
O  -3.661248 3.294804 -0.551861
C  2.399386 1.185266 -0.598823
C  1.222734 0.260995 -0.34345
C  3.621002 0.190693 -0.536125
C  -0.155702 0.448093 -0.258756
C  -1.064122 -0.619678 0.062109
C  -2.374141 -0.024491 0.052108
C  1.681525 -1.044521 -0.079805
C  -3.828561 -0.36379 0.264863
C  -2.209395 1.317068 -0.25868
C  2.704095 2.142271 0.556598
C  -4.548429 1.01101 0.031119
C  -0.542392 -1.924459 0.311652
C  0.853785 -2.145455 0.239756
C  -3.455596 2.075251 -0.30539
C  3.864343 1.77268 1.146684
C  -1.000297 -4.261297 0.889085
H  2.325212 1.710939 -1.566521
H  4.231699 0.055677 -1.439479
H  -4.172592 -1.140333 -0.441848
H  -4.008673 -0.761651 1.279811
H  2.047852 2.958011 0.855108
H  -5.106055 1.349811 0.92264
H  -5.269378 0.971163 -0.805034
H  1.305865 -3.12187 0.423731
H  4.40779 2.177956 1.998954
H  -0.322905 -4.270724 1.764145
H  -0.478432 -4.678189 0.006648
H  -1.900921 -4.8531 1.10568
