program: Gaussian 09
title: 000185880
version: EM64L-G09RevD.01
frameworkgroup: C1[X(C16H14O6)]
method: RPBEPBE
basis: SDD
operation: Freq
keyword: #pfreq=noraman
keyword: PBEPBE/SDD
title: #p freq=noraman PBEPBE/SDD
converged: YES YES NO NO
title: Mulliken charges:
elementType: O O O O O O C C C C C C C C C C C C C C C C H H H H H H H H H H H H H H
charge: -0.291648 -0.279574 -0.191568 -0.377756 -0.421212 -0.431590 -0.132086 -0.550810 0.291891 0.089583 0.104548 0.306882 0.188441 -0.336665 0.215747 -0.571455 -0.547874 -0.632487 0.375334 -0.374163 0.304598 -0.533160 0.254564 0.270268 0.251879 0.272535 0.282683 0.233256 0.216668 0.252285 0.355755 0.221515 0.221335 0.251486 0.358713 0.352084
chargesum: 0.00000
title: Mulliken charges with hydrogens summed into heavy atoms:
elementType: O O O O O O C C C C C C C C C C C C C C C C
charge: -0.291648 -0.279574 -0.191568 -0.022001 -0.062499 -0.079507 0.122479 -0.028663 0.291891 0.089583 0.104548 0.306882 0.188441 -0.064129 0.215747 -0.288773 -0.314619 -0.415819 0.375334 -0.121879 0.304598 0.161175
polarizability: 2.90185485e+02 -5.20579020e+00 2.14243277e+02 8.37431548e+00 7.91887044e-01 1.08358883e+02
1716.lowfreq: -1.8189 -0.0009 -0.0007 -0.0001 3.0819 6.1564 25.3380 34.8742 53.1453
frequency: 25.2889 34.7946 53.1449 65.8753 98.1442 102.3378 141.9877 157.5007 178.2115 196.8701 206.3610 229.0836 237.1153 259.3144 265.4340 288.3990 320.1012 322.8313 347.7375 367.0944 378.7306 380.2316 404.4927 431.0400 443.1918 457.2262 495.0670 509.3078 525.5309 528.3585 552.7129 586.4130 600.1436 614.7935 618.0891 638.3427 660.5698 683.1465 710.1574 724.3316 740.6158 774.9498 802.6862 826.9306 835.0796 851.0638 867.4937 916.1114 959.4157 966.2206 996.0519 1003.5140 1027.4936 1032.7868 1064.9880 1100.8316 1113.8874 1118.2128 1130.2644 1154.5035 1166.1758 1174.1459 1175.6702 1187.4259 1203.3013 1212.5650 1258.3016 1274.8928 1281.3918 1290.8363 1308.9141 1343.0570 1350.3727 1394.0834 1402.3899 1418.5290 1427.8223 1433.2893 1445.7929 1468.1604 1472.1339 1499.5597 1506.0229 1578.2656 1596.3409 1607.2342 1624.2733 1636.2441 2961.5187 2985.2006 3000.6170 3050.8392 3096.9333 3107.8695 3127.3961 3140.0868 3164.6158 3184.6334 3196.0909 3540.5559 3583.1365 3584.0101
redmass: 5.5056 6.4650 6.2246 8.9376 3.4370 3.6490 4.4439 5.2165 5.4496 1.9583 6.2667 5.3214 4.8381 6.3582 1.7267 4.5033 5.2038 1.1264 6.7074 1.1185 4.0679 6.7153 1.2174 4.9099 3.4394 3.4839 4.7206 5.6593 7.1182 4.2261 6.3840 4.4912 3.6776 3.8412 3.8586 3.8836 5.3407 4.2536 5.4791 2.8600 2.6362 2.2465 1.9182 1.7857 2.8888 1.7003 4.1227 5.6019 2.0639 1.7619 4.3964 4.5260 4.9318 5.3049 3.7737 1.9407 1.2586 1.5900 1.6441 1.3443 1.3939 1.4909 1.4345 1.3686 1.5902 1.9301 1.5453 2.8596 1.8675 2.1377 1.3567 2.4131 2.9832 6.2019 5.7907 2.2448 1.1274 3.3476 1.4381 1.0578 1.0875 3.4547 2.8564 8.0097 8.3738 6.8933 7.0403 7.2090 1.0329 1.0791 1.0701 1.1042 1.0956 1.0915 1.0993 1.0907 1.0882 1.0969 1.0930 1.0657 1.0661 1.0661
irintensity: 2.4784 3.6063 1.9329 1.1364 0.9441 6.0745 3.0151 0.0070 2.6315 0.5488 0.1483 3.6015 7.0782 4.3402 2.6283 6.7383 11.5555 129.3085 2.1972 156.7015 13.2584 8.9288 80.2384 4.6402 10.8925 21.4814 5.0382 14.7118 11.6548 14.6243 1.4353 6.6150 15.6904 24.4050 4.0390 2.9155 24.0608 1.2405 3.7257 8.6659 12.7714 35.1355 17.2162 30.7182 42.3724 38.5366 5.1923 51.7632 12.4246 6.6751 45.8703 43.9994 245.1195 96.6247 68.0802 81.4890 0.7427 335.8427 230.3305 28.5279 28.8651 26.6320 53.2094 10.5586 31.0582 59.9602 27.1228 210.2102 18.6284 53.3655 51.5216 52.0671 11.1659 96.8484 13.4176 30.7137 14.4188 127.5838 23.6989 21.3859 47.3461 36.5664 84.9265 20.6165 484.6125 99.9298 155.3112 343.6172 67.2438 4.3075 14.4067 42.8175 3.6536 14.4026 15.1606 13.1489 2.8248 4.0891 0.2354 24.7636 61.8567 36.5584
temp: 298.150 k
press: 1.00000 atm
elementType: 8 8 8 8 8 8 6 6 6 6 6 6 6 6 6 6 6 6 6 6 6 6 1 1 1 1 1 1 1 1 1 1 1 1 1 1
symmnumber: 1
zpe: 703304.3 jmol-1
zpe.correction: 0.267874 hartree
zpe.thermalcorrener: 0.287703 hartree
zpe.thermalcorrenthalpy: 0.288647 hartree
zpe.thermalcorrgfe: 0.219414 hartree
zpe.sumelectzpe: -1067.832981 hartree
zpe.sumelectthermal: -1067.813153 hartree
zpe.sumelectthermalent: -1067.812209 hartree
zpe.sumelectthermalfe: -1067.881442 hartree
dipole: 0.0184 0.3638 2.1709
dipole: 2.2012
quadrupole: -66.4662 -140.4810 -129.5142
quadrupole: -21.3372 -4.6245 8.4108
quadrupole: 45.6876 -28.3272 -17.3604 -21.3372 -4.6245 8.4108
hfenergy: -1068.1008559 hartree
pointgroup: C01 [X(C16H14O6)]
dipole: 0.0272283 -0.1362717 0.8548109 debye
polarizability: 289.1942716|-12.1321529|204.4080864|2.6668614|32.5225326|119.1852875 unknown
InChI: InChI=1S/C16H14O6/c1-21-13-5-8(17)2-3-10(13)14-7-12(20)16-11(19)4-9(18)6-15(16)22-14/h2-6,14,17-19H,7H2,1H3
charge 0 multiplicity 1
36 atoms
O  0.472547 -0.945056 -0.183997
O  -2.364406 1.551575 1.58516
O  2.051778 2.944735 -0.105851
O  4.530594 1.800982 0.066287
O  4.706724 -3.085384 -0.203881
O  -5.874851 -0.971802 -0.836465
C  -0.350299 0.219513 0.257531
C  0.14091 1.485179 -0.465064
C  -1.799538 -0.119507 -0.023175
C  2.468364 0.536452 -0.083698
C  1.627049 1.75609 -0.186585
C  1.85552 -0.764527 -0.150593
C  -2.822122 0.589646 0.665864
C  -2.184535 -1.095766 -0.967326
C  3.899707 0.561005 -0.020063
C  2.603578 -1.955655 -0.197865
C  -4.189709 0.328326 0.418672
C  4.666154 -0.624894 -0.059751
C  4.006764 -1.874174 -0.15945
C  -3.5412 -1.375482 -1.232768
C  -4.536064 -0.658763 -0.53692
C  -3.358645 2.291566 2.364891
H  -0.191871 0.340345 1.348512
H  -0.443261 2.359632 -0.13588
H  -0.007067 1.363169 -1.556708
H  -1.400112 -1.655461 -1.483662
H  2.10071 -2.923078 -0.241744
H  -4.974134 0.877685 0.951304
H  5.762751 -0.574393 -0.012754
H  -3.839486 -2.135573 -1.959256
H  5.515989 1.68811 0.060006
H  -3.973904 1.608732 2.982415
H  -4.013769 2.89643 1.708326
H  -2.774505 2.957055 3.016959
H  5.684092 -2.93853 -0.158867
H  -6.497951 -0.423476 -0.298405
