program: Gaussian 09
title: 000185860
version: EM64L-G09RevD.01
frameworkgroup: C1[X(C3H2ClF5O)]
method: RPBEPBE
basis: SDD
operation: Freq
keyword: #p
keyword: freq=noraman
keyword: PBEPBE/SDD
title: #p freq=noraman PBEPBE/SDD
converged: YES YES NO NO
title: Mulliken charges:
elementType: Cl F F F F F O C C C H H
charge: 0.054502 -0.186304 -0.146214 -0.143713 -0.128402 -0.174500 -0.199351 0.037654 0.397952 -0.081485 0.273100 0.296761
chargesum: 0.00000
title: Mulliken charges with hydrogens summed into heavy atoms:
elementType: Cl F F F F F O C C C
charge: 0.054502 -0.186304 -0.146214 -0.143713 -0.128402 -0.174500 -0.199351 0.310755 0.397952 0.215276
polarizability: 6.09898352e+01 -1.00923549e+01 4.52260662e+01 -1.60054363e+00 1.65338950e+00 3.84170788e+01
1716.lowfreq: -8.4623 -4.9418 -0.0012 0.0014 0.0019 6.2089 31.8457 51.2383 64.2770
frequency: 31.7103 51.2047 64.2378 106.7027 195.0324 225.4778 243.1676 322.8389 349.7210 372.3623 446.8725 497.7245 521.8068 564.4333 644.9174 756.7639 831.7628 901.9168 928.6993 945.3921 1038.9347 1050.7161 1057.8268 1219.7209 1252.4510 1271.2609 1297.9401 1357.4071 3076.7551 3113.8620
redmass: 14.9523 13.6775 16.0915 14.2179 16.0378 15.2750 17.3228 14.4824 16.1972 12.9404 14.5521 13.7111 10.5475 12.1421 13.5625 6.4991 4.8980 11.2455 8.8663 7.7873 9.3818 7.7470 11.3141 3.9597 1.1526 1.1102 1.1422 1.6977 1.0867 1.0889
irintensity: 1.1279 1.3181 1.5669 3.7479 4.0982 2.0444 1.7511 1.9765 1.8603 2.2788 9.3509 1.0918 12.0084 58.1857 4.9986 81.3206 33.8532 276.5663 81.6005 101.2870 125.4604 196.6226 585.7340 81.5040 26.9094 3.2643 1.9525 8.8824 11.0357 12.0597
temp: 298.150 k
press: 1.00000 atm
elementType: 17 9 9 9 9 9 8 6 6 6 1 1
symmnumber: 1
zpe: 147975.8 jmol-1
zpe.correction: 0.056361 hartree
zpe.thermalcorrener: 0.066585 hartree
zpe.thermalcorrenthalpy: 0.067529 hartree
zpe.thermalcorrgfe: 0.018132 hartree
zpe.sumelectzpe: -1149.193851 hartree
zpe.sumelectthermal: -1149.183627 hartree
zpe.sumelectthermalent: -1149.182683 hartree
zpe.sumelectthermalfe: -1149.232080 hartree
dipole: 1.2196 1.7420 0.1028
dipole: 2.1289
quadrupole: -65.5631 -62.6921 -63.4617
quadrupole: 0.9424 -4.0728 0.4012
quadrupole: -1.6574 1.2135 0.4439 0.9424 -4.0728 0.4012
hfenergy: -1149.2502121 hartree
pointgroup: C01 [X(C3H2Cl1F5O1)]
dipole: -0.546517 -0.6313119 0.0657783 debye
dipolederiv: -0.3950113 0.2179471 -0.100124 0.2822578 -0.3477976 0.1251644 -0.0697211 0.0678822 -0.137851 -0.3983145 0.0317885 -0.0025871 0.219895 -0.5849985 -0.1856576 0.1544176 -0.3093255 -0.4505828 -0.7080806 0.2867018 -0.0918609 0.1674545 -0.5006947 0.0612845 -0.0865189 0.082147 -0.3072529 -0.3659327 -0.0363126 -0.0189807 -0.0000194 -0.5230292 -0.2814898 0.0437336 -0.2411154 -0.5698684 -0.3750692 -0.0786467 0.1106464 -0.0811106 -0.3820477 0.2276751 0.0432197 0.1807191 -0.6694599 -0.4312065 -0.0035914 0.0492992 -0.0550035 -0.409505 0.1902853 0.1389267 0.3374991 -0.7582525 -1.646703 0.3056637 0.0600661 0.0839434 -0.4788395 -0.0398867 -0.1463513 0.0364367 -0.4623206 0.975994 -0.2821199 -0.0150925 -0.6199247 0.8866353 0.236634 0.0027749 0.2599634 0.6797798 1.4771534 -0.1562781 -0.0132956 -0.0324071 1.3832634 -0.0399037 0.0248433 -0.028573 1.5439595 1.8881457 -0.3438118 -0.0059233 -0.0011956 0.9798307 -0.2887443 -0.0606252 -0.3834571 1.1537991 0.0372313 -0.0163854 0.0336428 0.0513075 0.0236831 0.0402239 -0.0274655 0.0009227 -0.0200254 -0.0582064 0.0750449 -0.0057903 -0.0151975 -0.0465004 -0.0455852 -0.0172338 -0.0030992 -0.0019249 unknown
polarizability: 58.7364855|-11.2387951|47.063009|2.7598397|-2.6958779|38.8334857 unknown
InChI: InChI=1S/C3H2ClF5O/c4-2(6)10-1(5)3(7,8)9/h1-2H
charge 0 multiplicity 1
12 atoms
Cl -3.229341 1.155094 -0.491222
F  0.441295 -1.594015 -0.94179
F  2.697702 -0.601982 0.400613
F  1.55035 1.2126 1.139215
F  1.878013 0.903768 -1.088216
F  -2.277081 -0.712828 1.183277
O  -0.745124 0.328399 -0.253747
C  0.308997 -0.575108 0.080509
C  1.613578 0.250078 0.116261
C  -2.067898 -0.213505 -0.151162
H  0.143561 -1.095859 1.040122
H  -2.250051 -1.042142 -0.851658
