program: Gaussian 09
title: 000185859
version: EM64L-G09RevD.01
frameworkgroup: C1[X(C12H15N)]
method: RPBEPBE
basis: SDD
operation: Freq
keyword: #pfreq=noraman
keyword: PBEPBE/SDD
title: #p freq=noraman PBEPBE/SDD
converged: YES YES NO NO
title: Mulliken charges:
elementType: N C C C C C C C C C C C C H H H H H H H H H H H H H H H
charge: -0.298830 -0.040054 -0.606376 0.499136 -0.712463 -0.426597 -0.394511 -0.520211 -0.229105 -0.233088 -0.242981 0.206455 -0.498852 0.227829 0.230642 0.195650 0.218771 0.218236 0.239664 0.256567 0.234958 0.232017 0.247446 0.244661 0.224046 0.223458 0.227329 0.276203
chargesum: 0.00000
title: Mulliken charges with hydrogens summed into heavy atoms:
elementType: N C C C C C C C C C C C C
charge: -0.042263 0.187775 -0.180084 0.499136 -0.035791 -0.191638 -0.162494 -0.028105 -0.005059 -0.009630 -0.015652 0.206455 -0.222649
polarizability: 1.58918008e+02 2.33860590e+00 1.41316432e+02 -1.39526665e+01 1.22145618e+00 8.63946202e+01
1716.lowfreq: -13.4144 -3.7606 -0.0005 -0.0002 0.0002 5.8150 23.7903 34.1055 49.6389
frequency: 23.2175 34.0443 49.5864 70.7256 96.2537 173.9558 220.8392 228.9572 257.1879 281.8178 335.9414 349.4597 403.9000 405.8243 445.9334 500.0241 569.4371 593.9506 617.7403 630.5575 652.3715 674.4934 704.9730 751.6535 808.7222 830.7367 853.0556 882.4274 888.6343 909.9669 922.7559 974.7195 979.9312 990.1491 993.6328 1026.8148 1036.5160 1059.4498 1102.3995 1132.4420 1148.8698 1171.5690 1187.4314 1211.9616 1222.7611 1249.3580 1289.0726 1322.3882 1327.2150 1338.8341 1349.3746 1377.7515 1382.0204 1439.1243 1444.9179 1464.8009 1472.3033 1472.7866 1483.8741 1484.7002 1592.3437 1614.4120 2118.5955 2883.2472 2962.9594 2983.5307 2998.8423 3042.2348 3049.4969 3079.0179 3089.9886 3113.5612 3117.6085 3131.8762 3143.0540 3161.7776 3420.3872 3422.6424
redmass: 3.8667 4.4968 2.9952 3.7604 3.6082 1.7757 3.5430 1.8141 3.4861 3.7713 2.1095 2.2819 2.8074 2.6714 2.0602 3.2806 4.3083 3.7122 6.2811 1.2341 1.2329 1.7633 1.7911 1.8059 3.2293 2.5582 1.2495 1.6262 3.9368 1.6776 1.5668 1.3936 1.9605 6.1982 1.3172 2.2005 1.8484 1.8810 1.5319 2.4189 2.6859 1.0534 1.1179 1.6260 2.0332 1.1238 1.2758 1.2936 1.2291 1.3475 1.4107 1.2431 6.9951 2.0815 1.0871 1.1062 1.1313 1.1506 1.8640 1.1776 6.0309 6.1654 5.9870 1.0819 1.0639 1.0357 1.0597 1.0969 1.1010 1.0994 1.0994 1.0869 1.0866 1.0911 1.0959 1.1015 1.0756 1.1562
irintensity: 0.0435 0.0235 0.1243 0.1857 0.4607 0.4849 1.0369 0.5284 0.7543 3.5496 7.1363 1.2290 0.0208 1.4873 18.6441 27.1526 14.3535 13.6398 0.1533 74.8167 77.1258 76.7260 44.5775 60.9047 3.2163 3.8600 0.0531 1.7368 21.7766 4.4045 1.1299 0.1733 5.0720 0.0619 0.2729 7.4573 6.4009 3.2409 10.7476 4.5842 66.6202 0.1754 0.4313 3.6618 5.2762 6.7587 3.2562 7.0742 3.9488 14.5670 13.2643 25.7364 0.1965 7.9750 15.6079 12.3327 15.8779 5.0753 11.9177 17.8433 1.2859 8.0476 2.2744 49.8770 42.5928 16.7363 35.1027 18.6392 13.0045 38.0751 25.8154 9.4100 4.9678 12.4099 45.2890 23.2920 4.7490 52.2690
temp: 298.150 k
press: 1.00000 atm
elementType: 7 6 6 6 6 6 6 6 6 6 6 6 6 1 1 1 1 1 1 1 1 1 1 1 1 1 1 1
symmnumber: 1
zpe: 617463.8 jmol-1
zpe.correction: 0.235180 hartree
zpe.thermalcorrener: 0.248585 hartree
zpe.thermalcorrenthalpy: 0.249530 hartree
zpe.thermalcorrgfe: 0.193393 hartree
zpe.sumelectzpe: -519.984929 hartree
zpe.sumelectthermal: -519.971523 hartree
zpe.sumelectthermalent: -519.970579 hartree
zpe.sumelectthermalfe: -520.026716 hartree
dipole: -0.0717 0.4036 -0.2133
dipole: 0.4620
quadrupole: -76.3993 -72.7019 -79.8083
quadrupole: 0.4136 -3.8223 -1.3233
quadrupole: -0.0961 3.6013 -3.5051 0.4136 -3.8223 -1.3233
hfenergy: -520.2201086 hartree
pointgroup: C01 [X(C12H15N1)]
dipole: -0.0210873 0.1752989 -0.0432455 debye
polarizability: 160.5211014|4.2370976|137.0609907|-8.0455958|14.9181543|89.0469687 unknown
InChI: InChI=1S/C12H15N/c1-3-9-13-11(2)10-12-7-5-4-6-8-12/h1,4-8,11,13H,9-10H2,2H3
charge 0 multiplicity 1
28 atoms
N  2.347565 -0.724692 -0.727251
C  1.052387 -0.46408 -0.036289
C  -0.057016 -0.466702 -1.130155
C  -1.422658 -0.043754 -0.612019
C  0.79087 -1.527414 1.047885
C  -2.45792 -0.992503 -0.412441
C  -1.685487 1.316231 -0.298277
C  3.576661 -0.634237 0.096245
C  -3.720472 -0.597635 0.087322
C  -2.944306 1.716348 0.201801
C  -3.967927 0.75928 0.397275
C  3.819994 0.688703 0.737849
C  3.981084 1.804444 1.242298
H  1.048986 0.541287 0.451564
H  -0.099116 -1.479951 -1.571498
H  0.260338 0.226054 -1.938209
H  1.526492 -1.461166 1.869429
H  0.846629 -2.539702 0.607247
H  -0.210621 -1.384067 1.488975
H  2.433375 -0.131594 -1.565967
H  -2.272673 -2.0465 -0.653799
H  -0.899144 2.065967 -0.454033
H  3.540367 -1.412962 0.879169
H  4.438911 -0.884273 -0.550153
H  -4.508563 -1.345627 0.231768
H  -3.129426 2.771173 0.43544
H  -4.946233 1.068296 0.782392
H  4.130801 2.771777 1.68663
