program: Gaussian 09
title: 000185848
version: EM64L-G09RevD.01
frameworkgroup: C1[X(C14H10O4)]
method: RPBEPBE
basis: SDD
operation: Freq
keyword: #pfreq=noraman
keyword: PBEPBE/SDD
title: #p freq=noraman PBEPBE/SDD
converged: NO YES NO YES
title: Mulliken charges:
elementType: O O O O C C C C C C C C C C C C C C H H H H H H H H H H
charge: -0.296482 -0.431838 -0.437127 -0.436923 0.303308 0.244657 0.222014 0.448947 -0.474048 -0.388007 -0.536001 -0.610859 -0.602529 0.309590 -0.359253 0.369590 0.360318 -0.510770 0.254806 0.248636 0.247348 0.218683 0.257853 0.252184 0.277743 0.357139 0.356698 0.354324
chargesum: 0.00000
title: Mulliken charges with hydrogens summed into heavy atoms:
elementType: O O O O C C C C C C C C C C C C C C
charge: -0.296482 -0.074699 -0.080429 -0.082598 0.303308 0.244657 0.222014 0.448947 -0.219242 -0.139371 -0.288653 -0.392176 -0.344676 0.309590 -0.107069 0.369590 0.360318 -0.233027
polarizability: 3.32377298e+02 -2.45836711e+00 1.81595200e+02 -8.84206254e-03 2.19738089e-04 6.49035194e+01
1716.lowfreq: -7.5969 -7.0145 -0.9756 -0.0002 0.0008 0.0011 25.3301 51.4033 73.9757
frequency: 25.3185 51.4026 73.9736 138.9347 202.8138 216.5442 223.5867 228.1092 245.6594 285.5240 330.4886 345.6635 348.5735 357.6744 368.5716 370.1519 431.4837 458.2590 485.5342 500.5961 536.1220 554.4071 562.9879 594.4845 607.5794 614.1556 660.0600 678.3024 731.8131 741.0939 780.7636 804.9927 818.9767 824.0627 839.5368 850.3506 851.7428 866.0243 893.9512 944.3228 949.6906 972.1311 979.7597 1054.6440 1099.8959 1114.0934 1119.5104 1150.9386 1152.6832 1171.1984 1196.2750 1201.2514 1234.2506 1291.4661 1299.4075 1301.8681 1337.7292 1407.2356 1429.3872 1434.0985 1447.6192 1478.4372 1505.4652 1584.2039 1601.9729 1612.5840 1626.6332 1636.9302 3127.7267 3146.4411 3147.5089 3149.9805 3177.2271 3192.7651 3218.8217 3584.9342 3585.7720 3586.9882
redmass: 4.9959 7.9240 6.6050 7.4502 5.1585 3.8878 6.6292 4.1029 6.8911 6.2214 5.8120 1.1464 1.1997 4.1579 4.9581 1.1158 2.7564 4.3394 6.8527 7.3352 7.8478 4.9647 4.4713 4.1572 6.2204 3.7665 3.6598 1.8065 3.2889 7.6707 7.5556 1.3631 1.6065 1.5980 1.5354 4.4894 1.4955 1.9799 6.9713 3.9138 1.3373 4.1763 6.1814 2.3394 2.1785 1.3916 1.6689 1.4044 1.2920 1.3272 1.8343 1.3782 2.4137 1.5547 3.1185 1.8411 5.4278 7.6951 3.6921 4.4386 4.5887 3.8050 3.0225 7.3902 7.1586 6.7255 6.3841 7.7365 1.0913 1.0930 1.0919 1.0893 1.0964 1.0933 1.0979 1.0661 1.0659 1.0661
irintensity: 0.0027 0.0456 0.5358 1.0584 2.4275 5.8633 0.8686 0.6380 5.3519 1.2460 6.8081 85.5225 192.7651 18.6599 20.4119 127.7421 19.3507 2.1886 15.8852 14.7840 4.5941 2.0526 13.6956 0.0000 6.9778 12.2578 4.9431 26.0536 0.7064 4.1818 6.8741 0.0598 9.0927 15.8331 119.8168 17.8412 1.6964 64.6451 18.1598 36.3720 0.4363 128.7669 4.2902 0.3297 109.4437 191.6365 296.4471 195.3362 43.1066 0.0806 10.5350 13.2929 20.3324 28.4907 5.7487 44.2208 54.9154 29.5730 23.2278 56.7127 32.5871 97.2214 41.3904 59.2268 9.9649 203.7810 129.9666 109.7387 9.3712 7.7707 2.7651 4.8543 10.8326 0.1139 7.4324 62.1283 21.4455 57.4933
temp: 298.150 k
press: 1.00000 atm
elementType: 8 8 8 8 6 6 6 6 6 6 6 6 6 6 6 6 6 6 1 1 1 1 1 1 1 1 1 1
symmnumber: 1
zpe: 536848.8 jmol-1
zpe.correction: 0.204475 hartree
zpe.thermalcorrener: 0.219266 hartree
zpe.thermalcorrenthalpy: 0.220210 hartree
zpe.thermalcorrgfe: 0.162331 hartree
zpe.sumelectzpe: -839.121956 hartree
zpe.sumelectthermal: -839.107165 hartree
zpe.sumelectthermalent: -839.106221 hartree
zpe.sumelectthermalfe: -839.164100 hartree
dipole: 2.2696 -0.0870 -0.0001
dipole: 2.2713
quadrupole: -122.5932 -76.1601 -110.1530
quadrupole: 10.6750 0.0016 0.0001
quadrupole: -19.6245 26.8087 -7.1842 10.6750 0.0016 0.0001
hfenergy: -839.3264306 hartree
pointgroup: C01 [X(C14H10O4)]
dipole: 0.8932967 -0.0224455 -0.0000447 debye
polarizability: 332.4159339|-0.4652136|181.556564|-0.0088442|0.0001029|64.9035194 unknown
InChI: InChI=1S/C14H10O4/c15-10-2-1-8-5-13(18-14(8)7-10)9-3-11(16)6-12(17)4-9/h1-7,15-17H
charge 0 multiplicity 1
28 atoms
O  0.709532 0.847979 -0.00012
O  5.648451 1.254426 -0.000428
O  -4.061735 2.6572 0.00046
O  -4.75653 -2.072151 -0.000166
C  2.086046 -1.017583 0.000076
C  -0.104265 -0.336197 0.000043
C  2.043025 0.407233 -0.000122
C  -1.549651 -0.125154 0.000057
C  0.707082 -1.462678 0.000229
C  3.355889 -1.653268 0.000103
C  3.17562 1.232491 -0.0003
C  -2.433712 -1.238678 -0.000087
C  -2.078642 1.192306 0.00024
C  4.42381 0.564342 -0.000265
C  4.514813 -0.858084 -0.000065
C  -3.480227 1.379257 0.000282
C  -3.829056 -1.016831 -0.000032
C  -4.368923 0.286167 0.00015
H  0.365283 -2.496001 0.000442
H  3.440275 -2.744523 0.000261
H  3.091744 2.324753 -0.000455
H  -2.036235 -2.260917 -0.000267
H  -1.391568 2.045522 0.000353
H  5.512884 -1.305374 -0.000043
H  -5.449729 0.442534 0.00018
H  5.506195 2.233171 -0.000483
H  -3.364118 3.358411 0.000491
H  -4.294859 -2.946853 -0.000335
