program: Gaussian 09
title: 000185904
version: EM64L-G09RevD.01
frameworkgroup: C1[X(C25H26N2O3)]
method: RPBEPBE
basis: SDD
operation: Freq
keyword: #p
keyword: freq=noraman
keyword: PBEPBE/SDD
title: #p freq=noraman PBEPBE/SDD
converged: YES YES NO NO
title: Mulliken charges:
elementType: O O O N N C C C C C C C C C C C C C C C C C C C C C C C C C H H H H H H H H H H H H H H H H H H H H H H H H H H
charge: -0.452084 -0.334214 -0.301748 -0.351051 -0.424033 -0.119897 -0.189480 -0.641652 -0.608441 0.217713 -0.283011 0.541025 0.449371 -0.395303 -0.438275 0.170871 -0.390801 -0.411081 0.259640 -0.227728 -0.223732 -0.248206 -0.235532 -0.239245 -0.247863 -0.347623 -0.346604 -0.227519 -0.242814 -0.228056 0.266704 0.289356 0.225209 0.222274 0.234871 0.273358 0.336370 0.197477 0.191570 0.351483 0.229652 0.230897 0.270472 0.264104 0.370310 0.227636 0.228744 0.232111 0.228796 0.231752 0.229782 0.276377 0.216441 0.230949 0.229361 0.231319
chargesum: 0.00000
title: Mulliken charges with hydrogens summed into heavy atoms:
elementType: O O O N N C C C C C C C C C C C C C C C C C C C C C C C C C
charge: -0.081774 -0.334214 -0.301748 -0.014680 -0.072550 0.146807 0.099876 -0.194169 -0.100212 0.217713 0.106036 0.541025 0.449371 -0.165652 -0.207379 0.170871 -0.120330 -0.146977 0.259640 -0.000092 0.005012 -0.016095 -0.006736 -0.007493 -0.018081 -0.071247 -0.130163 0.003430 -0.013452 0.003262
polarizability: 3.31791829e+02 5.05346669e+01 2.40298090e+02 -6.23662614e-01 1.91850670e+01 2.76587312e+02
1716.lowfreq: -14.4911 -8.0761 -5.4719 -0.0004 -0.0004 -0.0001 1.2572 8.8238 16.0637
frequency: -13.2111 7.2054 15.9283 19.0930 20.0446 31.9049 35.0735 42.0422 54.2447 60.9669 87.0780 94.3879 123.9869 130.3703 135.5313 159.2787 166.2247 185.2070 218.8935 245.6282 256.1755 295.5654 310.7130 331.6260 332.9577 349.4228 349.9571 399.0157 402.5052 402.8226 413.3339 429.5809 448.0503 473.3122 498.0719 512.8855 533.6508 539.5142 565.1275 590.2197 601.9471 614.5763 616.1887 617.4462 648.2224 653.6030 683.4382 689.5679 702.3160 704.5767 708.1125 715.7878 756.6618 761.0625 795.0458 805.0570 820.9901 850.6146 853.5567 854.0741 862.6601 866.0885 869.7980 908.5041 922.1823 930.9568 936.2466 975.8568 981.8470 984.8229 986.2129 986.6952 989.3199 990.0010 990.5921 996.2614 997.3097 1004.1727 1008.0937 1024.0251 1026.4682 1026.6457 1039.0914 1066.6000 1068.2386 1079.6141 1086.7175 1093.8379 1112.4735 1150.2681 1165.0722 1172.3953 1172.4671 1173.4653 1175.9753 1188.5971 1190.8467 1194.2124 1212.9423 1216.1822 1218.2098 1239.3807 1254.0565 1266.0785 1290.1291 1302.1017 1315.9126 1319.8432 1330.1171 1336.1129 1340.0610 1354.9915 1373.7140 1379.6267 1383.9281 1385.6973 1405.8200 1432.8230 1440.7487 1441.2186 1460.9912 1465.0322 1470.5128 1476.3719 1483.8261 1484.5401 1495.4294 1517.2468 1550.2940 1584.0212 1588.5737 1594.3618 1602.1295 1611.1958 1612.2195 1615.1177 2942.0997 2978.3879 3004.6289 3008.6045 3017.3428 3032.8997 3043.7123 3078.4698 3110.2516 3114.2103 3117.3880 3119.9337 3122.8281 3131.6545 3132.8075 3133.2830 3143.7377 3145.0418 3145.9263 3158.1531 3161.5612 3164.6877 3169.0823 3415.0252 3495.6825 3530.2554
redmass: 4.0687 4.7576 5.7093 4.5785 4.0697 4.2784 5.4489 5.9248 7.7632 4.7289 5.5582 5.8291 3.8878 5.2006 3.3314 5.0412 5.3978 5.0298 4.7573 5.0459 5.4411 5.4978 5.1310 4.3906 3.5734 2.2259 3.1105 2.7712 2.8038 2.8569 4.0618 4.7340 3.5742 2.7909 2.7238 2.5561 1.4898 2.0901 2.1459 3.3735 4.3450 6.3651 6.2692 6.3356 1.2694 5.0594 5.2592 3.9263 1.5499 1.8268 2.0540 3.1320 1.7968 1.7609 2.3940 4.1587 4.0340 2.0731 1.4689 1.4893 1.6801 1.9156 2.2021 1.8104 1.5422 1.5504 1.4395 1.3911 2.0929 2.3937 1.4226 3.0134 5.9671 3.7070 5.0613 1.4934 1.3905 2.6319 1.3390 2.4966 2.2181 2.2156 1.8935 3.1676 2.8685 1.6116 1.7398 1.7113 2.7502 1.3232 1.7925 1.0607 1.0683 1.1001 1.2702 1.1153 1.1406 1.2084 1.4224 2.2161 2.3727 1.4703 1.1694 1.8513 1.4795 1.3117 1.4325 1.3398 1.3438 1.2519 1.3373 1.6255 1.3731 6.7724 5.8514 9.2104 1.2082 2.2550 2.1588 2.1257 1.9698 1.1567 1.1579 1.1429 2.1660 2.3234 2.4259 2.0248 8.7390 5.6538 5.9068 6.0489 6.2725 5.9092 6.0240 6.1722 1.0669 1.0615 1.0837 1.0740 1.0688 1.0986 1.0980 1.1045 1.0887 1.0876 1.0866 1.0881 1.0859 1.0877 1.0918 1.0895 1.0960 1.0925 1.0953 1.0957 1.1014 1.1014 1.1006 1.0675 1.0772 1.0783
irintensity: 0.0941 0.1824 0.2097 0.2626 0.1457 1.4613 0.8432 1.2314 4.9862 4.2343 9.8426 3.8152 16.5656 2.7535 4.7147 1.1604 4.0990 2.1532 17.2574 1.1537 12.8849 27.5050 5.7500 3.7936 3.7826 2.7873 1.7409 0.1810 0.0022 0.3945 0.4117 2.8121 5.5899 11.5674 82.9896 80.5214 163.7525 30.4531 116.5672 31.9853 10.2930 0.8163 0.3039 0.1605 65.8066 6.5915 4.4939 4.5214 118.2703 49.9573 68.8589 2.7101 60.7269 29.7656 24.4622 6.5689 7.5158 2.6423 1.9234 3.2001 1.0939 5.3888 13.1841 1.3227 2.7978 16.0868 3.6539 0.0912 14.4520 5.5343 0.0643 29.8815 0.3853 0.2249 4.2814 1.3737 1.0626 9.4841 1.2655 8.3000 5.3621 8.2891 8.3491 4.1800 3.3330 14.0825 12.9548 6.5466 22.6537 1.4608 4.9800 1.3112 1.4162 1.1461 10.0902 1.2448 0.1821 10.3314 4.6001 0.4615 0.0404 27.0817 29.0845 21.3078 51.2415 13.1147 1.8464 5.5882 10.1099 2.4827 3.1555 25.6810 3.7080 4.4740 0.2115 1.6477 37.9218 15.4209 3.8005 8.4350 535.6065 4.0313 12.7110 20.0748 15.9938 19.3323 313.4863 101.8318 167.7144 98.3123 0.4577 1.6622 5.3990 8.5020 5.5573 5.6667 91.4177 29.0023 3.6463 3.2544 25.4363 8.7654 52.1161 4.1854 10.9297 10.4067 4.0546 0.4659 7.8655 4.1022 7.0753 5.9657 23.6001 24.9768 34.2941 15.9532 27.8159 19.9591 24.8605 92.2720 78.9314 27.6828
temp: 298.150 k
press: 1.00000 atm
elementType: 8 8 8 7 7 6 6 6 6 6 6 6 6 6 6 6 6 6 6 6 6 6 6 6 6 6 6 6 6 6 1 1 1 1 1 1 1 1 1 1 1 1 1 1 1 1 1 1 1 1 1 1 1 1 1 1
symmnumber: 1
zpe: 1193779.2 jmol-1
zpe.correction: 0.454686 hartree
zpe.thermalcorrener: 0.481525 hartree
zpe.thermalcorrenthalpy: 0.482469 hartree
zpe.thermalcorrgfe: 0.391601 hartree
zpe.sumelectzpe: -1301.320063 hartree
zpe.sumelectthermal: -1301.293225 hartree
zpe.sumelectthermalent: -1301.292281 hartree
zpe.sumelectthermalfe: -1301.383149 hartree
dipole: -2.4704 2.3599 -0.4068
dipole: 3.4405
quadrupole: -152.8379 -174.5922 -179.2897
quadrupole: 6.5753 7.6306 7.1152
quadrupole: 16.0687 -5.6856 -10.3831 6.5753 7.6306 7.1152
hfenergy: -1301.7747497 hartree
pointgroup: C01 [X(C25H26N2O3)]
dipole: 0.0912515 1.265464 -0.4717346 debye
polarizability: 323.8057183|-47.0812469|247.2950828|34.0732761|13.5094053|277.5764296 unknown
InChI: InChI=1S/C25H26N2O3/c28-18-22(16-19-10-4-1-5-11-19)26-25(30)23(17-20-12-6-2-7-13-20)27-24(29)21-14-8-3-9-15-21/h1-15,22-23,26-28H,16-18H2
charge 0 multiplicity 1
56 atoms
O  -2.511073 1.45519 2.808354
O  0.147692 0.663141 2.159624
O  1.489966 -2.979619 -0.809598
N  -1.062872 1.321094 0.284885
N  1.148226 -1.49929 0.932643
C  -1.444244 2.633918 0.847671
C  -0.034871 -0.922878 0.295897
C  -1.756812 3.636537 -0.294838
C  -1.283751 -1.875797 0.4339
C  -0.303784 0.424621 0.9804
C  -2.650522 2.520778 1.819396
C  -0.584719 3.883123 -1.234854
C  -2.454618 -1.464102 -0.441749
C  0.553461 4.608979 -0.797422
C  -0.598904 3.379721 -2.56013
C  1.862472 -2.506815 0.318607
C  -3.595123 -0.818615 0.104367
C  -2.410592 -1.707675 -1.841339
C  3.085738 -3.025303 1.030276
C  1.650887 4.821178 -1.65997
C  0.498509 3.588438 -3.427367
C  -4.672121 -0.43583 -0.728513
C  -3.483582 -1.319331 -2.675396
C  1.628079 4.309343 -2.978961
C  -4.619946 -0.6834 -2.120688
C  3.695297 -4.188869 0.494915
C  3.65374 -2.413393 2.179179
C  4.843077 -4.740128 1.099763
C  4.804708 -2.964789 2.783576
C  5.400604 -4.130654 2.248565
H  -0.565487 2.982723 1.425074
H  0.171953 -0.795972 -0.783713
H  -2.075631 4.584444 0.180408
H  -2.629516 3.261204 -0.866182
H  -1.574577 -1.917697 1.498842
H  -0.918771 -2.873584 0.132532
H  -1.441773 1.045774 -0.624568
H  -3.573879 2.290761 1.255571
H  -2.780896 3.506366 2.318861
H  1.38627 -1.102787 1.847669
H  0.579959 5.01394 0.222434
H  -1.477602 2.828849 -2.920805
H  -3.630436 -0.60812 1.180697
H  -1.538979 -2.220118 -2.268166
H  -1.543412 1.329204 3.021632
H  2.521328 5.385531 -1.306974
H  0.470481 3.191717 -4.448379
H  -5.552679 0.048282 -0.290637
H  -3.439931 -1.523273 -3.751353
H  2.479544 4.47317 -3.648577
H  -5.457742 -0.392518 -2.76452
H  3.247134 -4.634999 -0.398919
H  3.227425 -1.497951 2.606091
H  5.303297 -5.640756 0.678831
H  5.238005 -2.483432 3.66714
H  6.292996 -4.55653 2.720717
