program: Gaussian 09
title: 000185812
version: EM64L-G09RevD.01
frameworkgroup: C1[X(C12H18O2)]
method: RPBEPBE
basis: SDD
operation: Freq
keyword: #pfreq=noraman
keyword: PBEPBE/SDD
title: #p freq=noraman PBEPBE/SDD
converged: YES YES NO NO
title: Mulliken charges:
elementType: O O C C C C C C C C C C C C H H H H H H H H H H H H H H H H H H
charge: -0.277399 -0.247598 -0.204082 0.218186 -0.404284 -0.548510 -0.534099 -0.039061 0.601295 -0.746307 -0.756673 -0.832546 0.280584 -0.760269 0.238983 0.289269 0.236913 0.242212 0.244258 0.225544 0.280329 0.209144 0.226615 0.217398 0.211907 0.224193 0.211122 0.216891 0.238631 0.246769 0.245412 0.245174
chargesum: 0.00000
title: Mulliken charges with hydrogens summed into heavy atoms:
elementType: O O C C C C C C C C C C C C
charge: -0.277399 -0.247598 0.034901 0.218186 -0.115015 -0.069385 -0.064297 0.241268 0.601295 -0.093151 -0.109450 -0.377025 0.280584 -0.022914
polarizability: 1.52982391e+02 3.27872950e+00 1.32412974e+02 4.13836996e+00 1.69755360e+00 1.02939743e+02
1716.lowfreq: -34.1412 -13.8290 -7.6705 -0.0008 -0.0007 -0.0001 21.5088 47.2939 63.3039
frequency: -33.8497 47.2564 63.1069 82.8786 103.8885 175.2737 191.8558 209.1788 222.7734 256.3171 270.2184 289.6632 326.6198 368.0750 415.8743 436.1692 438.9394 486.5479 546.2421 569.1935 606.0652 623.4496 672.5196 701.6598 740.0765 760.6849 802.3401 835.7475 875.8907 890.1624 910.6447 922.0778 933.7777 942.0930 944.2352 958.4307 966.2198 989.8515 995.3767 1005.5526 1013.9780 1040.5881 1054.3632 1090.4404 1128.6438 1150.0766 1164.3092 1184.3649 1194.8607 1203.9036 1215.7367 1228.6250 1245.4072 1267.2764 1282.8636 1297.3149 1308.6129 1330.2330 1375.7513 1380.5906 1393.0035 1429.7065 1452.8239 1454.5340 1458.8029 1460.4668 1474.8839 1478.5383 1486.6224 1497.3961 1644.9817 1678.6471 2973.2576 2977.0809 3006.5033 3026.4359 3027.7328 3061.1606 3061.9234 3065.1622 3069.2664 3079.8316 3085.9065 3087.5566 3094.5406 3095.4925 3096.0756 3101.4010 3141.7059 3185.7192
redmass: 1.0649 5.2315 4.1251 3.2973 3.3107 1.5772 2.4723 2.0450 1.3459 2.3699 2.4586 2.8550 3.2672 2.5330 2.4263 2.8851 2.1834 2.4672 3.1666 3.2405 4.8722 3.5616 4.0477 1.1981 2.8550 3.7788 2.9786 2.4793 3.5811 2.4195 1.9442 2.4689 1.5130 1.4772 2.5640 1.7051 2.2115 1.6953 1.5211 1.5603 1.6274 1.6672 1.5832 1.1905 1.6760 2.1904 1.9696 1.8852 2.0389 3.1364 2.2274 1.9651 1.6268 1.3566 1.5729 1.7712 1.7302 1.3657 1.1904 1.2495 1.2024 1.1658 1.0624 1.0490 1.0647 1.0552 1.0647 1.0582 1.0659 1.0784 9.3315 6.1053 1.0360 1.0362 1.0369 1.0626 1.0612 1.0891 1.0981 1.0897 1.0977 1.1001 1.0908 1.0704 1.0982 1.0970 1.0954 1.1010 1.1010 1.1135
irintensity: 1.0743 0.5830 1.8063 1.8693 0.0734 0.2158 5.5908 0.9251 0.9991 2.0609 0.5102 3.3749 2.4552 0.3483 1.7997 2.6583 0.6756 1.1263 0.7546 1.6389 6.7275 8.1322 2.8765 0.1937 2.2390 2.1168 5.9110 0.1959 17.3670 8.7809 1.9926 15.8727 3.8378 42.3090 42.4243 2.1799 43.7709 58.6866 23.0262 9.2530 54.8929 8.1558 12.1225 14.3381 2.5800 11.3106 10.7524 4.5604 55.9303 303.7958 12.3835 1.3796 1.4914 0.3953 6.6484 1.9065 1.9460 5.1756 15.2597 54.6393 13.1420 13.0710 26.5016 19.1049 5.8597 1.6439 9.5158 12.0994 19.8790 6.9872 160.3360 22.7616 25.2376 42.6374 3.2542 21.6229 23.8845 33.1731 2.0327 4.4685 73.0485 21.6893 33.2007 31.4845 37.3935 14.5126 12.5444 12.5708 11.1703 16.3926
temp: 298.150 k
press: 1.00000 atm
elementType: 8 8 6 6 6 6 6 6 6 6 6 6 6 6 1 1 1 1 1 1 1 1 1 1 1 1 1 1 1 1 1 1
symmnumber: 1
zpe: 717053.8 jmol-1
zpe.correction: 0.273111 hartree
zpe.thermalcorrener: 0.286726 hartree
zpe.thermalcorrenthalpy: 0.287670 hartree
zpe.thermalcorrgfe: 0.233202 hartree
zpe.sumelectzpe: -617.422924 hartree
zpe.sumelectthermal: -617.409310 hartree
zpe.sumelectthermalent: -617.408365 hartree
zpe.sumelectthermalfe: -617.462833 hartree
dipole: 0.7391 -2.3780 -0.3765
dipole: 2.5185
quadrupole: -79.1475 -89.0048 -84.3470
quadrupole: 5.7462 3.2553 -0.9441
quadrupole: 5.0189 -4.8384 -0.1806 5.7462 3.2553 -0.9441
hfenergy: -617.6960351 hartree
pointgroup: C01 [X(C12H18O2)]
dipole: -0.190541 -0.4975401 0.8354371 debye
polarizability: 151.4746966|8.1586621|114.0066887|7.0208754|-12.8073256|122.8537225 unknown
InChI: InChI=1S/C12H18O2/c1-7-10-5-9(12(7,3)4)6-11(10)14-8(2)13/h9-11H,1,5-6H2,2-4H3
charge 0 multiplicity 1
32 atoms
O  2.172477 -0.112872 0.365956
O  2.785782 1.206643 -1.462307
C  -1.111113 -0.884607 1.17392
C  -2.176857 -0.518922 0.068158
C  -0.131165 0.88345 0.11307
C  -0.551144 0.516885 1.568265
C  0.158267 -1.515713 0.519877
C  0.809537 -0.316142 -0.230538
C  -1.42971 0.632493 -0.660013
C  -3.493756 -0.012289 0.723278
C  -2.536439 -1.690795 -0.879811
C  -1.8310 1.288262 -1.774349
C  3.067545 0.679292 -0.361859
C  4.385865 0.794123 0.375124
H  -1.533982 -1.492758 1.990855
H  0.330278 1.864287 -0.071326
H  0.312378 0.455739 2.253763
H  -1.300658 1.20379 1.992196
H  0.854712 -1.867501 1.301389
H  -0.059706 -2.365974 -0.145249
H  0.933952 -0.444119 -1.318288
H  -3.998549 -0.838855 1.259157
H  -3.318646 0.807455 1.440569
H  -4.185375 0.366299 -0.051297
H  -3.335552 -1.385158 -1.579952
H  -1.677381 -2.018374 -1.489506
H  -2.908919 -2.559855 -0.304299
H  -2.772659 1.047372 -2.282882
H  -1.227465 2.088955 -2.216631
H  4.758616 -0.205404 0.655518
H  4.245088 1.367041 1.308892
H  5.122178 1.307247 -0.25998
