program: Gaussian 09
title: 000185797
version: EM64L-G09RevD.01
frameworkgroup: C1[X(C13H26O)]
method: RPBEPBE
basis: SDD
operation: Freq
keyword: #pfreq=noraman
keyword: PBEPBE/SDD
title: #p freq=noraman PBEPBE/SDD
converged: YES YES NO NO
title: Mulliken charges:
elementType: O C C C C C C C C C C C C C H H H H H H H H H H H H H H H H H H H H H H H H H H
charge: -0.441103 -0.384067 -0.386366 -0.382115 -0.370978 -0.372632 -0.388840 -0.353340 -0.411579 -0.356637 -0.136211 -0.696476 -0.100527 -0.582958 0.194139 0.192547 0.193380 0.194161 0.192869 0.191677 0.195360 0.190465 0.189978 0.189041 0.182953 0.218757 0.187385 0.188081 0.188117 0.223572 0.194642 0.194949 0.233818 0.209581 0.215128 0.209771 0.210869 0.330743 0.216836 0.235012
chargesum: 0.00000
title: Mulliken charges with hydrogens summed into heavy atoms:
elementType: O C C C C C C C C C C C C C
charge: -0.110360 0.002619 0.001175 0.002431 0.014846 0.006387 0.012869 0.022126 0.000110 0.032954 0.097607 -0.061996 0.110342 -0.131110
polarizability: 1.78656906e+02 7.26634912e+00 1.35622389e+02 2.08458337e+00 4.44934977e+00 1.21676084e+02
1716.lowfreq: -8.5624 -4.7016 0.0001 0.0006 0.0012 12.1362 20.0752 30.0739 31.4645
frequency: 19.9718 29.7556 30.9881 51.3071 67.1632 72.7582 92.7829 109.7308 111.8775 131.2663 147.2072 151.1721 156.5559 201.3395 233.3386 255.8408 264.5446 300.5886 335.4653 359.9627 382.6619 451.2935 481.6790 527.6615 565.2261 707.9767 719.1764 722.3540 730.9823 749.1415 782.6727 807.4233 836.6519 888.1875 892.2997 935.0605 953.7869 963.4915 973.6231 993.5190 1000.2061 1007.5361 1017.2125 1039.9609 1051.7179 1057.6505 1072.5199 1079.6810 1081.9674 1098.5052 1120.1739 1135.4565 1183.0463 1193.4910 1208.5495 1221.2922 1234.8618 1247.2690 1259.6425 1271.7672 1276.4779 1280.3609 1285.5812 1286.8035 1292.7089 1295.9317 1301.3840 1309.6049 1332.4507 1349.0323 1353.1219 1355.0396 1356.9266 1362.6285 1388.9947 1411.8355 1453.1365 1459.2969 1459.7524 1463.0639 1464.1232 1469.2686 1475.3311 1477.5597 1481.1277 1485.8504 1488.7003 1651.5150 2948.6732 2948.9941 2950.5154 2950.9491 2953.6824 2958.1522 2963.1012 2967.8399 2971.5247 2971.8427 2981.6609 2985.5369 2991.5114 2999.7164 3002.9083 3009.7472 3020.6372 3031.1554 3040.0502 3046.7098 3068.0388 3070.2411 3084.6033 3103.9408 3206.8188 3541.9667
redmass: 3.3846 2.3048 2.8770 3.5847 1.6471 3.0200 3.2991 1.6656 2.7830 2.4513 1.9271 2.5166 2.6396 3.6054 1.1237 3.2381 3.1351 1.0824 3.1837 2.3914 3.1920 2.9740 2.9591 1.7992 2.9310 2.6636 1.0598 1.0723 1.1000 1.1528 1.2644 2.3346 1.3344 1.8890 1.3900 1.5932 1.3671 2.3704 1.4974 2.5031 2.8428 1.5186 1.1841 2.2015 1.6257 2.8548 2.5713 2.0648 2.2583 2.4945 2.5919 1.4162 1.8197 1.3498 1.4990 1.4535 1.3989 1.3659 1.3731 1.2935 1.0540 1.1901 1.1683 1.2108 1.1657 1.0935 1.1809 1.3094 1.4008 1.5358 1.6663 1.6115 1.2471 1.4773 1.2171 1.1972 1.0824 1.0738 1.0726 1.0635 1.0746 1.0826 1.0833 1.0424 1.0867 1.0920 1.0933 4.9406 1.0587 1.0584 1.0592 1.0592 1.0597 1.0596 1.0590 1.0585 1.0366 1.0616 1.0961 1.0971 1.0986 1.1001 1.0845 1.1022 1.1038 1.1042 1.1040 1.1026 1.1007 1.0993 1.0736 1.0781 1.1148 1.0654
irintensity: 0.2589 0.3884 0.0466 0.5924 0.0662 0.6375 0.9616 0.1109 0.5340 0.3217 0.1091 0.6406 0.6070 0.1732 0.0016 4.9729 1.7588 126.3193 0.5649 32.0776 0.9700 0.4060 0.4845 11.1319 13.4985 7.2585 17.4044 0.2052 7.2817 0.4694 5.5775 15.4694 4.9420 4.2331 3.1635 20.1008 64.2489 21.8573 5.6439 6.0244 6.1195 17.5413 3.3330 0.2867 8.6217 6.3176 2.8355 0.0036 1.1482 12.2577 15.2842 34.5405 2.0170 15.5889 7.1342 5.3101 4.5691 1.1575 1.2690 1.1382 0.1587 0.0368 0.8146 0.0408 0.4389 0.1993 1.7543 0.5338 0.7590 2.4558 0.9913 1.3510 18.3323 0.7861 11.2058 13.5785 3.9488 0.0245 0.3174 0.1440 0.0932 0.5719 1.0751 12.3200 1.8358 3.2805 33.0395 6.6561 0.3471 0.0478 0.1950 0.0917 3.4131 0.0751 76.2254 159.9329 36.4036 83.0005 0.0221 0.0391 0.1888 1.4756 37.2139 0.6853 3.3545 0.9460 105.0949 186.2453 97.9142 55.2066 19.0736 8.7853 15.5802 3.6724
temp: 298.150 k
press: 1.00000 atm
elementType: 8 6 6 6 6 6 6 6 6 6 6 6 6 6 1 1 1 1 1 1 1 1 1 1 1 1 1 1 1 1 1 1 1 1 1 1 1 1 1 1
symmnumber: 1
zpe: 948693.2 jmol-1
zpe.correction: 0.361338 hartree
zpe.thermalcorrener: 0.380154 hartree
zpe.thermalcorrenthalpy: 0.381098 hartree
zpe.thermalcorrgfe: 0.311309 hartree
zpe.sumelectzpe: -585.003167 hartree
zpe.sumelectthermal: -584.984352 hartree
zpe.sumelectthermalent: -584.983407 hartree
zpe.sumelectthermalfe: -585.053197 hartree
dipole: -1.6833 0.5882 -1.2141
dipole: 2.1572
quadrupole: -108.8957 -89.6560 -89.4055
quadrupole: 4.6050 -7.6588 1.7000
quadrupole: -12.9100 6.3297 6.5802 4.6050 -7.6588 1.7000
hfenergy: -585.3645056 hartree
pointgroup: C01 [X(C13H26O1)]
dipole: 0.6589066 0.2660396 0.4640948 debye
polarizability: 178.7457007|-6.775897|134.9029062|2.7456402|-5.2918395|122.3067719 unknown
InChI: InChI=1S/C13H26O/c1-3-5-6-7-8-9-10-11-12-13(14)4-2/h4,13-14H,2-3,5-12H2,1H3
charge 0 multiplicity 1
40 atoms
O  -5.240366 -0.514307 -1.406937
C  1.49925 -0.628466 0.295043
C  0.138549 -0.057769 -0.164042
C  2.709249 0.188601 -0.211167
C  -1.069128 -0.87738 0.343088
C  4.068841 -0.374872 0.2604
C  -2.432266 -0.292021 -0.090642
C  5.279855 0.442838 -0.242522
C  -3.626624 -1.138002 0.405438
C  6.638784 -0.117148 0.236544
C  -5.021512 -0.553817 0.050716
C  7.843007 0.707136 -0.268227
C  -5.267881 0.79573 0.711496
C  -5.839367 1.866176 0.106788
H  1.593927 -1.677872 -0.054999
H  1.52336 -0.668419 1.40439
H  0.043652 0.990723 0.188656
H  0.11389 -0.015576 -1.273147
H  2.691279 0.221639 -1.320756
H  2.61011 1.239969 0.131878
H  -0.984725 -1.921772 -0.02365
H  -1.033469 -0.934092 1.451453
H  4.169158 -1.426038 -0.082973
H  4.085603 -0.408487 1.370133
H  -2.452761 -0.228673 -1.199356
H  -2.525305 0.746007 0.288547
H  5.178849 1.495244 0.096926
H  5.268287 0.472833 -1.352374
H  -3.564407 -1.249622 1.508141
H  -3.56267 -2.1554 -0.02643
H  6.648642 -0.148175 1.345361
H  6.740002 -1.168079 -0.10397
H  -5.79335 -1.269712 0.395949
H  7.780918 1.75468 0.082782
H  8.801401 0.287142 0.088948
H  7.873705 0.726547 -1.374156
H  -4.950727 0.865754 1.763459
H  -4.614199 0.151361 -1.792988
H  -5.992414 2.809699 0.641316
H  -6.187847 1.810519 -0.930915
