program: Gaussian 09
title: 000185847
version: EM64L-G09RevD.01
frameworkgroup: C1[X(C17H27NO6)]
method: RPBEPBE
basis: SDD
operation: Freq
keyword: #p
keyword: freq=noraman
keyword: PBEPBE/SDD
title: #p freq=noraman PBEPBE/SDD
converged: YES YES NO NO
title: Mulliken charges:
elementType: O O O O O O N C C C C C C C C C C C C C C C C C H H H H H H H H H H H H H H H H H H H H H H H H H H H
charge: -0.274290 -0.279875 -0.476146 -0.442259 -0.265362 -0.277037 -0.107577 -0.253481 -0.049338 -0.488434 -0.457577 0.435234 -0.397702 -0.401703 -0.525548 0.188898 -0.034596 0.172703 -0.141726 0.335332 -0.749310 -0.754019 -0.736485 -0.768304 0.300565 0.264951 0.215421 0.249504 0.237772 0.230100 0.202863 0.236927 0.256484 0.295355 0.235019 0.229213 0.259176 0.217628 0.228076 0.235016 0.241269 0.205793 0.248053 0.244386 0.237335 0.214063 0.359945 0.245768 0.263983 0.242925 0.351012
chargesum: 0.00000
title: Mulliken charges with hydrogens summed into heavy atoms:
elementType: O O O O O O N C C C C C C C C C C C C C C C C C
charge: -0.274290 -0.279875 -0.116201 -0.091247 -0.265362 -0.277037 -0.107577 0.047084 0.215613 -0.023510 0.010295 0.435234 0.042088 -0.145219 0.004825 0.188898 0.194617 0.172703 0.117450 0.335332 -0.068590 -0.058904 -0.040702 -0.015628
polarizability: 2.25312314e+02 1.57977782e+01 2.17282998e+02 4.22621634e+00 -8.73081073e+00 1.78689613e+02
1716.lowfreq: -8.8655 -3.7220 -0.0011 -0.0011 -0.0010 6.7928 20.3280 25.7008 28.7517
frequency: 19.3715 25.0284 28.6165 51.7500 67.0585 75.7122 78.5231 89.9915 94.6581 98.5893 100.8629 108.6369 131.7444 163.6608 179.6688 202.6142 207.9950 216.4966 227.2980 237.2039 239.1580 268.4578 278.2658 283.3325 297.6613 308.3338 331.9804 353.2540 366.3845 370.7080 381.7871 401.8157 413.7078 438.6333 441.7384 464.1981 481.2363 522.8837 562.6900 569.3768 580.0011 600.2945 612.9630 630.5460 655.9430 691.7584 706.4297 739.0567 781.7672 795.5488 836.6410 853.2319 857.3812 873.2499 877.4138 881.6621 919.5876 924.3085 929.4699 934.4128 944.8108 963.7921 969.2665 975.9131 992.3526 999.7078 1000.7026 1019.0400 1032.5873 1043.2503 1045.3266 1060.9885 1090.5304 1099.1513 1107.4601 1115.6408 1127.1776 1148.0231 1149.5500 1157.2248 1170.0755 1177.0205 1180.8481 1204.3442 1220.1265 1225.6369 1256.5397 1265.5454 1273.6325 1279.6054 1297.3976 1301.7146 1311.9018 1312.8740 1320.4549 1324.8247 1334.5539 1341.8925 1350.0511 1361.3361 1370.3510 1375.7586 1379.8301 1381.7314 1393.8448 1452.8429 1454.5430 1456.7324 1465.4021 1469.5941 1471.2059 1472.1579 1473.8944 1476.8037 1481.6656 1486.5061 1495.9385 1601.2645 1637.9829 1657.9668 2887.3421 2975.1871 2981.8708 2982.9099 2986.1367 3003.1094 3005.6842 3007.9474 3015.7265 3017.7081 3026.0552 3058.4904 3062.4068 3065.8524 3074.5052 3077.1672 3081.9945 3086.4600 3088.6482 3095.0454 3100.6270 3101.6338 3117.0384 3139.3944 3164.4551 3467.4266 3507.6525
redmass: 4.3687 4.5361 4.2823 3.9822 2.9046 3.9590 5.1723 3.8555 3.8706 1.6074 2.1940 5.1852 3.3456 3.6705 3.4589 3.8221 3.3936 1.1522 2.4931 1.5588 1.1566 4.0316 2.9246 3.0716 3.6510 2.2931 2.8324 2.6925 3.5347 2.2725 1.7620 2.1319 2.7476 1.4877 2.3236 3.1922 2.9515 4.3462 3.9328 3.7339 3.7623 4.5657 3.9301 4.1800 2.7587 5.4263 4.3833 4.7253 2.7284 3.2852 1.9477 3.3399 3.0047 3.9528 2.5825 2.5966 1.2904 1.8258 3.2298 3.4451 2.5364 1.6225 2.9211 2.7621 1.7768 2.4497 2.1720 1.7376 1.6381 1.8099 1.7600 2.3316 2.5470 2.0548 2.3746 3.4893 2.8500 1.2068 2.2357 2.7915 1.3998 1.5668 2.0160 3.0592 1.3087 1.7780 1.5388 1.4441 1.2270 1.4817 1.3865 1.3924 1.3981 1.2912 1.3735 1.4504 1.3283 1.3015 1.6630 1.9286 1.1729 1.2177 1.2217 1.2419 1.2053 1.0846 1.0557 1.0635 1.1233 1.0536 1.0462 1.0511 1.0495 1.0829 1.0865 1.0526 1.0498 9.0235 9.8831 7.2221 1.0709 1.0361 1.0378 1.0876 1.0353 1.0655 1.0379 1.0629 1.0837 1.0856 1.0619 1.0870 1.0886 1.0980 1.1001 1.0994 1.0989 1.0943 1.1028 1.1004 1.0941 1.1000 1.1060 1.1026 1.0970 1.0650 1.0651
irintensity: 0.4754 0.3140 0.0499 0.7084 1.6403 0.3795 3.0292 5.5861 0.7708 3.2632 1.2374 0.5819 0.2713 3.2447 4.8690 4.4509 1.6469 1.6713 1.9389 1.7172 2.4407 12.5135 6.2127 2.4868 2.8860 3.8554 39.5881 1.4423 10.5339 21.8387 32.6194 7.6422 1.8612 108.2482 53.1859 2.7037 26.5284 2.2539 1.4635 33.8298 19.0356 5.3423 5.7700 1.8128 6.8126 1.0410 21.6457 17.3731 52.6429 40.6603 6.2788 12.7342 9.7047 3.5968 8.3702 29.1109 3.3319 8.5166 4.1159 24.6661 1.2456 2.5085 53.9345 76.1186 2.2245 3.1512 86.0496 0.4278 60.5649 13.6067 4.6642 12.2407 54.6490 29.1193 190.8769 29.4317 32.5872 10.4863 2.7578 87.7884 40.8932 50.8697 4.0208 238.9803 23.2538 2.8470 24.7454 4.4820 1.8636 11.3311 2.9762 15.7629 29.0028 2.0770 5.2194 1.2435 3.3086 4.7813 13.9757 8.5347 42.0971 27.4515 20.9522 64.6864 18.4160 7.1322 22.6687 15.9196 13.9677 2.3727 5.3824 2.7748 13.0549 1.9080 14.2854 10.4912 12.9702 145.3592 169.9637 6.1868 79.3395 25.6549 15.4928 43.7667 30.0437 52.7748 2.2513 19.9631 4.5585 9.0064 17.2653 7.9063 5.1361 45.0011 20.7321 11.2866 29.1812 59.7759 29.3054 21.8061 9.8979 16.7681 6.4873 8.0554 8.3929 39.7647 20.3418
temp: 298.150 k
press: 1.00000 atm
elementType: 8 8 8 8 8 8 7 6 6 6 6 6 6 6 6 6 6 6 6 6 6 6 6 6 1 1 1 1 1 1 1 1 1 1 1 1 1 1 1 1 1 1 1 1 1 1 1 1 1 1 1
symmnumber: 1
zpe: 1106845.5 jmol-1
zpe.correction: 0.421575 hartree
zpe.thermalcorrener: 0.447954 hartree
zpe.thermalcorrenthalpy: 0.448898 hartree
zpe.thermalcorrgfe: 0.364294 hartree
zpe.sumelectzpe: -1168.192177 hartree
zpe.sumelectthermal: -1168.165799 hartree
zpe.sumelectthermalent: -1168.164854 hartree
zpe.sumelectthermalfe: -1168.249458 hartree
dipole: -4.9394 -1.3445 0.6498
dipole: 5.1602
quadrupole: -147.5215 -137.8832 -144.0717
quadrupole: 6.7724 -2.3448 -7.9270
quadrupole: -4.3627 5.2756 -0.9129 6.7724 -2.3448 -7.9270
hfenergy: -1168.613752 hartree
pointgroup: C01 [X(C17H27N1O6)]
dipole: -1.9870089 0.4068913 0.0888984 debye
polarizability: 228.7468943|-6.2981134|199.6588507|-13.2626568|19.6536047|192.8791791 unknown
InChI: InChI=1S/C17H27NO6/c1-10(2)17(22,11(3)19)16(21)23-9-13-5-7-18-8-6-14(15(13)18)24-12(4)20/h5,10-11,14-15,19,22H,6-9H2,1-4H3
charge 0 multiplicity 1
51 atoms
O  -2.788555 -1.727635 -1.165889
O  1.181607 1.122451 -0.322262
O  3.278897 -1.817613 0.32391
O  3.985279 1.807953 -0.240786
O  0.806164 -1.170781 -0.564982
O  -1.492563 -0.889114 -2.918919
N  -2.830311 0.399504 1.629749
C  -2.032927 0.078535 0.403757
C  -3.071853 -0.328404 -0.723109
C  -4.452676 -0.289149 -0.03593
C  -4.12667 -0.311379 1.490908
C  -1.272774 1.36346 0.112844
C  -2.863337 1.887698 1.799169
C  -1.762573 2.376841 0.878699
C  -0.187672 1.455106 -0.918484
C  2.941436 -0.391691 0.393755
C  2.93583 0.086463 1.891646
C  1.53746 -0.211082 -0.211882
C  4.014415 0.358767 -0.477399
C  -1.918773 -1.865281 -2.256653
C  1.853552 -0.659829 2.705895
C  4.33194 -0.103457 2.525668
C  3.920405 0.020913 -1.974733
C  -1.560583 -3.313212 -2.484769
H  -1.369892 -0.791038 0.561594
H  -3.002542 0.319914 -1.612439
H  -4.964696 0.65444 -0.30106
H  -5.087994 -1.128999 -0.363581
H  -4.005597 -1.354683 1.837072
H  -4.904495 0.164099 2.112121
H  -3.845264 2.338725 1.515287
H  -2.675251 2.170521 2.854176
H  -1.419519 3.415785 0.859139
H  -0.360723 0.766999 -1.765032
H  -0.035577 2.486105 -1.271379
H  2.701449 1.167908 1.878457
H  4.99601 0.036642 -0.093696
H  1.864678 -0.311393 3.754154
H  2.049345 -1.747589 2.707481
H  0.832348 -0.48918 2.315135
H  4.674715 -1.146169 2.402238
H  4.284798 0.12067 3.607161
H  5.076245 0.575705 2.07589
H  4.014393 -1.067608 -2.130228
H  4.738252 0.528428 -2.513848
H  2.962597 0.359114 -2.414519
H  2.452014 -2.310385 0.066024
H  -2.325083 -3.987121 -2.070271
H  -0.600625 -3.512794 -1.973436
H  -1.418364 -3.500129 -3.560461
H  3.071155 2.130169 -0.462587
