program: Gaussian 09
title: 000185790
version: EM64L-G09RevD.01
frameworkgroup: C1[X(C17H12O2)]
method: RPBEPBE
basis: SDD
operation: Freq
keyword: #pfreq=noraman
keyword: PBEPBE/SDD
title: #p freq=noraman PBEPBE/SDD
converged: YES YES NO NO
title: Mulliken charges:
elementType: O O C C C C C C C C C C C C C C C C C H H H H H H H H H H H H
charge: -0.451501 -0.192225 0.180323 -0.221231 0.147360 0.257683 -0.558889 0.273324 -0.021984 0.172486 -0.446152 -0.403523 -0.417758 0.429810 -0.491950 -0.348036 -0.438048 -0.257581 -0.246613 0.231850 0.262805 0.245612 0.273184 0.229398 0.277749 0.237260 0.346563 0.223103 0.244423 0.230553 0.232003
chargesum: 0.00000
title: Mulliken charges with hydrogens summed into heavy atoms:
elementType: O O C C C C C C C C C C C C C C C C C
charge: -0.104938 -0.192225 0.180323 0.010619 0.147360 0.257683 -0.050472 0.273324 -0.021984 0.172486 -0.172968 -0.174124 -0.140010 0.429810 -0.254690 -0.124934 -0.193624 -0.027027 -0.014610
polarizability: 3.39754404e+02 9.08699047e+00 2.00978686e+02 3.20845075e+00 -5.38040364e+00 8.03234659e+01
1716.lowfreq: -9.4967 -6.4976 -4.1656 -0.0005 -0.0002 0.0004 54.4637 59.3642 75.4797
frequency: 54.4580 59.3606 75.4792 118.2487 145.3612 170.6325 228.6602 250.6816 271.3925 285.5053 290.2820 338.0735 389.9931 415.1801 442.9818 471.8088 483.5106 499.2130 528.1865 543.6022 567.8325 573.1552 585.6102 618.8787 629.6535 664.5397 694.0080 749.3656 760.1454 770.8096 807.0579 831.8238 850.7922 855.3702 860.8218 892.8006 897.2284 935.4127 959.5533 977.8950 989.9214 990.0635 998.7787 1021.2212 1033.8973 1045.3021 1055.4768 1132.5957 1148.2455 1159.2422 1167.0153 1179.4227 1195.1406 1228.8738 1234.0472 1245.4841 1263.2718 1269.8823 1290.3375 1316.5957 1356.3370 1381.4118 1403.9872 1407.3937 1424.9304 1433.2777 1443.4501 1452.4851 1501.9601 1536.7434 1584.5352 1601.1736 1618.7381 1625.9342 1638.9064 2943.0941 3009.6090 3081.7428 3124.9667 3129.8946 3136.0520 3146.1862 3154.0734 3165.9603 3171.5670 3172.0158 3554.6145
redmass: 5.0478 4.8183 3.9782 4.2496 6.7145 4.6174 4.1759 4.7813 4.6457 1.1316 6.3969 5.5736 3.3870 3.7974 4.7954 4.5117 3.2170 4.4580 4.7105 3.3469 4.0941 7.3209 5.0521 3.4457 4.5400 5.2844 3.8704 2.9367 1.9407 2.1700 2.0559 2.7355 1.6668 4.6818 2.4777 1.9565 3.7971 4.4509 1.3946 1.8130 1.9141 1.3642 1.4196 4.2539 2.6012 2.7252 3.9348 1.7503 1.2641 1.3149 1.3023 1.0962 1.3010 1.4920 1.9353 1.6480 1.8156 1.6190 2.0720 2.2272 1.8428 3.4898 4.2841 2.7596 1.2775 2.8539 3.4557 2.3372 3.6807 4.6974 7.9383 6.9978 6.9463 6.8797 11.0470 1.0838 1.0614 1.1009 1.0865 1.0890 1.0886 1.0892 1.0927 1.0997 1.0961 1.0958 1.0663
irintensity: 0.7294 0.5036 5.9624 3.6049 0.1293 2.5988 12.7955 4.1444 1.7218 109.5317 7.4861 14.9843 1.9888 6.3188 5.5888 4.1452 5.2791 4.0328 2.9634 1.4658 0.6125 1.5460 6.0098 1.1327 4.9659 5.0954 5.5569 0.5427 23.3136 63.0356 0.3812 20.2763 35.9931 2.6109 17.6163 12.9538 20.8585 7.7594 4.2965 19.4948 18.3539 0.7541 0.5850 57.1862 7.1182 26.5442 23.4724 19.9272 32.3407 5.3081 4.1687 7.0076 16.6803 12.8576 7.2178 3.8089 51.0190 8.2217 85.1206 6.9306 55.2538 1.3018 9.9636 2.4426 4.1334 15.7629 2.9097 0.1807 4.5547 25.8484 46.9149 24.1568 63.0998 58.6257 280.2342 37.4840 7.6962 14.4990 1.1981 10.0938 9.2834 5.0033 21.4851 13.5009 32.7663 10.3399 4.7431
temp: 298.150 k
press: 1.00000 atm
elementType: 8 8 6 6 6 6 6 6 6 6 6 6 6 6 6 6 6 6 6 1 1 1 1 1 1 1 1 1 1 1 1
symmnumber: 1
zpe: 626312.2 jmol-1
zpe.correction: 0.238550 hartree
zpe.thermalcorrener: 0.252899 hartree
zpe.thermalcorrenthalpy: 0.253843 hartree
zpe.thermalcorrgfe: 0.197268 hartree
zpe.sumelectzpe: -804.192829 hartree
zpe.sumelectthermal: -804.178480 hartree
zpe.sumelectthermalent: -804.177536 hartree
zpe.sumelectthermalfe: -804.234110 hartree
dipole: 2.3783 2.8244 -1.0767
dipole: 3.8462
quadrupole: -103.6134 -98.2044 -114.7563
quadrupole: -19.1241 2.2679 -4.0373
quadrupole: 1.9112 7.3203 -9.2316 -19.1241 2.2679 -4.0373
hfenergy: -804.4313788 hartree
pointgroup: C01 [X(C17H12O2)]
dipole: 0.9595753 -1.1010353 0.3958577 debye
polarizability: 339.8101958|-7.0047212|200.831463|-7.7032942|-4.0843648|80.4148976 unknown
InChI: InChI=1S/C17H12O2/c18-15-9-16(19)17-13-6-5-10-3-1-2-4-11(10)12(13)7-8-14(15)17/h1-8,16,19H,9H2
charge 0 multiplicity 1
31 atoms
O  -2.559299 -2.534567 -0.649925
O  -4.53896 1.780715 0.190274
C  -1.678775 -0.385579 0.147065
C  -2.757845 -1.44833 0.33384
C  -2.244812 0.899445 0.090024
C  -0.26398 -0.566323 0.099447
C  -4.096842 -0.679112 0.15579
C  0.57302 0.611766 0.003803
C  -3.725809 0.820205 0.152373
C  2.028315 0.447129 -0.029786
C  -1.434071 2.062774 -0.007751
C  -0.046802 1.906649 -0.047861
C  0.33828 -1.880119 0.152563
C  2.588026 -0.882534 0.039255
C  1.710984 -2.02737 0.12856
C  2.933839 1.55025 -0.126528
C  4.006227 -1.058058 0.011765
C  4.321112 1.35614 -0.151888
C  4.866194 0.041522 -0.081774
H  -2.688802 -1.873692 1.359151
H  -4.53372 -0.925414 -0.830796
H  -4.853746 -0.892314 0.92992
H  -1.904638 3.050043 -0.047604
H  0.578322 2.801151 -0.117887
H  -0.325549 -2.748395 0.176985
H  2.162669 -3.025693 0.166314
H  -3.259516 -3.221344 -0.505596
H  2.549464 2.572743 -0.18367
H  4.411388 -2.07542 0.064237
H  4.990752 2.219779 -0.226561
H  5.951671 -0.103146 -0.102437
