program: Gaussian 09
title: 000185798
version: EM64L-G09RevD.01
frameworkgroup: C1[X(C14H20O2)]
method: RPBEPBE
basis: SDD
operation: Freq
keyword: #pfreq=noraman
keyword: PBEPBE/SDD
title: #p freq=noraman PBEPBE/SDD
converged: NO YES NO NO
title: Mulliken charges:
elementType: O O C C C C C C C C C C C C C C H H H H H H H H H H H H H H H H H H H H
charge: -0.207689 -0.207659 0.155125 0.154933 0.175631 0.175424 -0.732698 -0.722628 -0.739695 -0.739283 -0.732482 -0.722726 0.031172 0.031255 -0.271115 -0.270799 0.268703 0.212335 0.211517 0.216965 0.210752 0.217956 0.236440 0.262157 0.207487 0.235979 0.207548 0.262244 0.268793 0.211584 0.212104 0.217884 0.217227 0.210765 0.267415 0.267380
chargesum: 0.00000
title: Mulliken charges with hydrogens summed into heavy atoms:
elementType: O O C C C C C C C C C C C C C C
charge: -0.207689 -0.207659 0.155125 0.154933 0.175631 0.175424 -0.040143 -0.076954 -0.033612 -0.033512 -0.040001 -0.076850 0.031172 0.031255 -0.003700 -0.003419
polarizability: 2.01223544e+02 -1.26274457e-02 1.56539020e+02 1.21315129e+01 2.10593134e-02 1.17777979e+02
1716.lowfreq: 0.0004 0.0007 0.0010 12.6385 17.6373 18.9653 54.7771 80.5785 95.1027
frequency: 54.6182 80.5266 95.1020 144.6406 156.4936 170.1939 171.0321 211.5091 228.2871 231.3522 243.3374 250.4422 263.5724 266.5218 268.6696 285.0335 298.0419 321.9497 332.7919 375.8622 390.3405 414.7323 428.2287 445.1493 455.0123 493.0534 494.6981 577.2941 584.2386 621.8957 627.4208 688.4810 788.7214 797.3971 800.7537 839.7036 869.0729 901.9453 913.6172 924.9280 931.0135 935.1737 943.8441 951.8231 988.6343 1018.9711 1026.2149 1028.5710 1035.3775 1052.1512 1087.9036 1182.4522 1187.4440 1202.6028 1203.0854 1210.4054 1230.8303 1270.0914 1270.8930 1345.4218 1369.6898 1370.2955 1375.0746 1381.6477 1404.2625 1409.1239 1450.7564 1458.7137 1466.0706 1470.1510 1475.3870 1480.1429 1481.0086 1482.0013 1486.4167 1486.6085 1506.9474 1509.5625 1514.7945 1522.5110 1539.9281 1647.7661 2981.8687 2982.3818 2988.6957 2989.0576 2991.5780 2993.7850 3067.1720 3067.5913 3073.9247 3075.1203 3087.2953 3088.3140 3116.2840 3116.6909 3125.0546 3126.0321 3136.8496 3145.0289 3149.6273 3172.7166
redmass: 3.1953 4.9533 4.0561 2.6667 2.8261 1.4226 1.3067 2.8621 2.5613 1.3853 1.8274 1.7370 1.4132 1.2236 2.4072 1.6433 2.5602 3.1889 2.2273 2.4212 4.4644 2.5309 2.8329 4.3896 2.9810 3.2615 3.2082 3.0798 3.2727 2.9340 6.4029 5.9600 4.3175 3.8708 5.8380 2.0116 3.3417 2.9261 1.9240 2.0636 1.6705 1.7252 1.2152 1.1815 1.3087 1.8387 1.3538 1.4089 1.3672 1.9541 1.4244 2.3431 2.4875 2.7500 2.9847 2.7034 2.7637 3.7782 3.0466 2.0320 1.1744 1.1740 1.1854 1.1863 1.2049 1.2107 1.0514 1.0528 1.1332 1.0515 1.0690 1.1127 1.0570 2.8520 1.1465 1.0824 1.1015 1.2348 1.1144 4.0396 5.0307 7.4355 1.0381 1.0380 1.0388 1.0389 1.0398 1.0413 1.0997 1.0996 1.0985 1.0983 1.0947 1.0947 1.1001 1.1000 1.0975 1.0974 1.0952 1.0864 1.0891 1.1032
irintensity: 3.3020 0.1080 10.3444 0.0370 0.2451 0.1066 0.2274 0.3755 0.2707 0.1953 0.0060 0.8309 0.0059 0.1696 0.5699 0.4886 3.4227 1.1709 0.3714 1.9616 10.3443 0.1978 1.0661 0.0162 1.6868 11.9550 4.1829 5.0241 0.1504 4.8506 0.8604 4.8528 4.4055 1.3747 0.3627 59.0772 1.3341 3.2466 2.9142 12.0916 2.1442 11.7929 0.7272 0.0134 0.0068 25.3724 2.1369 9.2624 0.0222 16.4901 53.1951 0.9460 27.3858 1.4696 13.3122 26.9101 34.2641 9.1774 97.1827 3.7495 18.9458 8.9959 60.5251 0.9888 51.1047 2.7544 0.9589 0.1322 7.1569 14.5330 26.5607 0.2571 2.0068 11.9646 7.9299 32.2749 0.0418 34.5381 69.5980 15.3201 164.9553 7.6193 28.4443 14.6095 37.9115 30.7391 40.4007 41.5468 1.4271 2.4343 57.4990 64.7887 42.2634 25.9482 7.6961 11.4682 11.8923 11.1590 31.3990 0.5558 18.0258 7.5756
temp: 298.150 k
press: 1.00000 atm
elementType: 8 8 6 6 6 6 6 6 6 6 6 6 6 6 6 6 1 1 1 1 1 1 1 1 1 1 1 1 1 1 1 1 1 1 1 1
symmnumber: 1
zpe: 797750.6 jmol-1
zpe.correction: 0.303847 hartree
zpe.thermalcorrener: 0.321271 hartree
zpe.thermalcorrenthalpy: 0.322215 hartree
zpe.thermalcorrgfe: 0.261339 hartree
zpe.sumelectzpe: -694.645576 hartree
zpe.sumelectthermal: -694.628152 hartree
zpe.sumelectthermalent: -694.627208 hartree
zpe.sumelectthermalfe: -694.688085 hartree
dipole: -0.0074 -0.8970 0.0057
dipole: 0.8970
quadrupole: -107.5364 -90.1147 -101.2528
quadrupole: 0.0063 -8.2620 0.0113
quadrupole: -7.9017 9.5199 -1.6182 0.0063 -8.2620 0.0113
hfenergy: -694.9494236 hartree
pointgroup: C01 [X(C14H20O2)]
dipole: 0.0223145 0.338129 -0.0986252 debye
polarizability: 198.9342182|-7.3592969|154.1979138|-16.5283836|-9.2479177|122.4084111 unknown
InChI: InChI=1S/C14H20O2/c1-13(2,3)11-9(15)7-8-10(16)12(11)14(4,5)6/h7-8H,1-6H3
charge 0 multiplicity 1
36 atoms
O  -2.476309 -0.761229 1.692929
O  2.261438 -1.714282 -0.591045
C  -1.706739 1.162554 -0.35108
C  1.763708 1.082786 0.048718
C  -0.732275 0.087042 0.22534
C  0.663951 -0.023811 0.12031
C  -2.982519 0.414836 -0.888958
C  -1.12899 1.873422 -1.609014
C  -2.18403 2.199758 0.711464
C  2.313931 1.317509 -1.391872
C  2.971595 0.616469 0.943907
C  1.307397 2.420391 0.698889
C  -1.40843 -1.003595 1.038842
C  1.196353 -1.445448 0.057002
C  -0.797999 -2.350681 1.168155
C  0.444432 -2.571224 0.666934
H  -3.594119 -0.002383 -0.076432
H  -3.599782 1.140842 -1.448528
H  -2.706902 -0.399515 -1.58576
H  -0.278051 2.53461 -1.403805
H  -1.925275 2.49618 -2.056278
H  -0.814602 1.131124 -2.365823
H  -1.351879 2.792844 1.122594
H  -2.690719 1.682256 1.542029
H  -2.902179 2.897577 0.240534
H  1.540742 1.692135 -2.081351
H  3.127515 2.066543 -1.351464
H  2.722796 0.377729 -1.796907
H  3.512505 -0.232538 0.502729
H  2.63466 0.338288 1.960746
H  3.675847 1.462332 1.042669
H  0.941757 2.249238 1.728376
H  0.524884 2.950675 0.14159
H  2.180294 3.095799 0.757525
H  -1.399354 -3.109956 1.679379
H  0.947251 -3.544177 0.67345
