program: Gaussian 09
title: 000185768
version: EM64L-G09RevD.01
frameworkgroup: C1[X(C17H16O4)]
method: RPBEPBE
basis: SDD
operation: Freq
keyword: #pfreq=noraman
keyword: PBEPBE/SDD
title: #p freq=noraman PBEPBE/SDD
converged: YES YES NO NO
title: Mulliken charges:
elementType: O O O O C C C C C C C C C C C C C C C C C H H H H H H H H H H H H H H H H
charge: -0.288570 -0.220255 -0.255752 -0.256245 -0.281313 -0.188893 0.510566 0.116194 0.202733 -0.422861 -0.375558 0.216834 -0.344025 -0.225886 -0.232366 -0.237881 -0.513118 -0.411145 0.358919 -0.537628 -0.535824 0.256083 0.263222 0.231247 0.262367 0.248829 0.228383 0.230051 0.231946 0.280712 0.247198 0.275332 0.236141 0.231510 0.250488 0.223134 0.225430
chargesum: 0.00000
title: Mulliken charges with hydrogens summed into heavy atoms:
elementType: O O O O C C C C C C C C C C C C C C C C C
charge: -0.288570 -0.220255 -0.255752 -0.256245 -0.025230 0.074329 0.510566 0.116194 0.202733 -0.191614 -0.113191 0.216834 -0.095197 0.002497 -0.002315 -0.005935 -0.232407 -0.163946 0.358919 0.205355 0.163228
polarizability: 2.65526985e+02 -1.02375675e+01 2.40349567e+02 1.75073542e+01 -4.66342493e+00 1.10171006e+02
1716.lowfreq: -5.8176 -4.7769 -0.0005 -0.0004 0.0004 1.4852 20.7555 32.4705 37.6217
frequency: 20.6900 32.4427 37.5962 60.4430 75.4004 86.3098 119.4787 122.2409 141.9325 176.5301 206.5047 214.1696 218.9649 229.4486 264.5910 265.6182 301.3193 306.4328 335.9362 356.4843 390.7809 403.0061 456.1520 472.6145 485.4714 526.0322 553.3123 595.4792 604.6627 614.3745 632.8385 654.1997 696.1607 702.4717 712.4791 728.9039 756.7404 773.7209 800.2892 809.4883 839.3759 853.8429 859.9394 876.4465 921.9298 939.6307 975.1591 976.5213 989.2328 997.0788 1007.6873 1025.2562 1030.3970 1060.2725 1086.1331 1099.1098 1110.6986 1114.1575 1129.0773 1145.6319 1163.2781 1173.6319 1180.1339 1185.9929 1188.8838 1232.7382 1243.3396 1266.3425 1276.4977 1282.8085 1324.6578 1376.2963 1382.7423 1395.2797 1415.9332 1433.5891 1445.7887 1449.6632 1458.4772 1467.9426 1471.0663 1472.1578 1484.3557 1487.8327 1535.9396 1565.0934 1593.5843 1616.0518 1622.8781 2965.9698 2980.4982 3056.9905 3089.5905 3101.0284 3106.8345 3117.4687 3125.2576 3129.5263 3130.5527 3134.8037 3140.2502 3151.4471 3166.7072 3173.5835 3185.6309
redmass: 4.6073 4.3342 5.3336 4.9787 4.8014 3.8923 4.6887 3.8776 4.4403 4.3908 1.8580 3.2284 4.8705 2.5908 4.0642 1.6014 2.1917 4.6118 5.4072 4.2138 6.6189 2.8362 3.6144 5.0163 4.9773 4.5561 4.3645 5.6725 6.5126 6.4475 3.6509 4.7026 5.9631 2.0636 3.8518 5.3894 2.3771 2.0888 2.1749 4.7966 4.8153 1.2755 6.0444 1.6191 1.4312 1.3269 7.5922 1.4267 5.9155 1.3361 3.6143 2.3156 3.1623 1.3863 1.5057 1.2819 1.2570 1.2837 1.7543 1.4597 1.4017 1.0817 2.0475 1.2477 1.7077 1.6287 2.4228 2.9703 1.6361 1.6719 1.3797 3.5535 4.7267 3.3317 3.9233 1.2072 2.1951 1.3646 1.1207 1.0505 1.0749 1.1078 2.4110 2.4603 6.6059 8.5775 6.0925 6.0414 6.7832 1.0328 1.0320 1.1043 1.1012 1.0919 1.0869 1.0876 1.1048 1.0863 1.0994 1.0888 1.0912 1.0961 1.1015 1.0944 1.0922
irintensity: 0.6049 0.2395 0.8953 0.8344 5.4218 5.5606 5.6889 2.2867 1.8872 2.1959 0.5963 5.7486 4.3297 1.5510 6.3641 0.2369 2.1036 3.6352 3.0945 1.1521 4.1773 0.3317 9.9708 6.2277 12.2904 5.9029 35.7845 32.8528 3.3432 0.2549 13.7454 9.4803 0.1280 31.2816 57.8662 7.3739 72.6628 24.1210 28.2045 12.0148 17.6781 0.6393 0.1555 42.7507 2.1825 3.8864 2.3319 0.1944 0.3404 0.5086 41.1229 4.4063 43.2577 3.0548 9.1566 35.3684 0.1925 5.1097 127.8279 10.4840 71.6139 0.4958 34.6153 30.9178 45.9133 6.8444 80.1670 246.6200 16.6321 34.0770 10.9529 18.7580 47.8895 15.7065 7.7571 3.4576 7.7120 13.3202 21.5287 15.3247 81.7043 13.4004 81.3242 9.2465 201.5884 135.4018 0.4660 7.5351 344.7361 64.2297 33.4094 43.5237 18.8516 1.4627 24.4257 14.4932 26.0766 0.1859 26.1153 4.8247 13.6053 26.9890 23.9173 7.8484 0.2499
temp: 298.150 k
press: 1.00000 atm
elementType: 8 8 8 8 6 6 6 6 6 6 6 6 6 6 6 6 6 6 6 6 6 1 1 1 1 1 1 1 1 1 1 1 1 1 1 1 1
symmnumber: 1
zpe: 753219.1 jmol-1
zpe.correction: 0.286886 hartree
zpe.thermalcorrener: 0.306302 hartree
zpe.thermalcorrenthalpy: 0.307246 hartree
zpe.thermalcorrgfe: 0.237332 hartree
zpe.sumelectzpe: -956.709653 hartree
zpe.sumelectthermal: -956.690237 hartree
zpe.sumelectthermalent: -956.689293 hartree
zpe.sumelectthermalfe: -956.759208 hartree
dipole: 1.3693 5.5099 -0.3337
dipole: 5.6873
quadrupole: -115.2020 -108.4668 -128.5923
quadrupole: -7.2420 4.9570 5.1526
quadrupole: 2.2184 8.9535 -11.1719 -7.2420 4.9570 5.1526
hfenergy: -956.9965393 hartree
pointgroup: C01 [X(C17H16O4)]
dipole: 0.589758 -2.1560623 -0.1010109 debye
polarizability: 264.5788258|12.6922365|240.4977086|-18.137163|8.3815325|110.9710241 unknown
InChI: InChI=1S/C17H16O4/c1-19-12-8-9-13(14(10-12)20-2)15(18)17-16(21-17)11-6-4-3-5-7-11/h3-10,16-17H,1-2H3
charge 0 multiplicity 1
37 atoms
O  1.487895 1.659057 1.0273
O  -0.768062 2.680315 -1.071018
O  -3.144578 2.072214 0.975768
O  -4.585257 -2.325958 0.14488
C  1.599143 0.227089 0.549453
C  1.021633 1.27231 -0.373792
C  2.973329 -0.323794 0.340259
C  -0.459956 1.558697 -0.560029
C  -1.469344 0.54917 -0.150664
C  3.184188 -1.722748 0.431719
C  4.069852 0.527137 0.046814
C  -2.755995 0.862391 0.41383
C  -1.242219 -0.801083 -0.554015
C  4.468263 -2.268204 0.210185
C  5.352993 -0.018131 -0.167279
C  5.555878 -1.41726 -0.092634
C  -3.758342 -0.130549 0.484779
C  -2.232103 -1.792401 -0.488539
C  -3.511681 -1.4398 0.027122
C  -2.16439 3.085891 1.403316
C  -4.381923 -3.711886 -0.291355
H  0.890277 -0.439305 1.057399
H  1.66573 1.68408 -1.162754
H  2.344149 -2.384523 0.678204
H  3.913873 1.611636 0.022243
H  -0.275916 -1.054596 -1.004351
H  4.621687 -3.350744 0.281122
H  6.19732 0.644967 -0.385998
H  6.553754 -1.838091 -0.258395
H  -4.725859 0.120291 0.925975
H  -2.016641 -2.801478 -0.848527
H  -1.882503 3.727125 0.552392
H  -1.256532 2.611868 1.822259
H  -2.687076 3.664096 2.180254
H  -5.342139 -4.212987 -0.102496
H  -3.58208 -4.203917 0.294595
H  -4.140859 -3.761281 -1.370427
