program: Gaussian 09
title: 000185751
version: EM64L-G09RevD.01
frameworkgroup: C1[X(C12H7Cl3O2)]
method: RPBEPBE
basis: SDD
operation: Freq
keyword: #p
keyword: freq=noraman
keyword: PBEPBE/SDD
title: #p freq=noraman PBEPBE/SDD
converged: NO YES NO NO
title: Mulliken charges:
elementType: Cl Cl Cl O O C C C C C C C C C C C C H H H H H H H
charge: -0.019291 -0.019303 -0.031651 -0.434637 -0.485525 0.334128 0.470950 -0.447931 -0.353826 -0.270201 -0.270208 0.197690 -0.323330 0.135035 -0.230973 -0.230975 -0.087419 0.267709 0.243366 0.223908 0.285990 0.285991 0.385472 0.375031
chargesum: 0.00000
title: Mulliken charges with hydrogens summed into heavy atoms:
elementType: Cl Cl Cl O O C C C C C C C C C C C C
charge: -0.019291 -0.019303 -0.031651 -0.049166 -0.110493 0.334128 0.470950 -0.180222 -0.110460 -0.270201 -0.270208 0.197690 -0.099422 0.135035 0.055017 0.055016 -0.087419
polarizability: 2.46834527e+02 1.81782515e-03 1.41471780e+02 -3.96774134e+00 -3.83770278e-02 1.10944694e+02
1716.lowfreq: -14.3764 -3.2137 -0.0031 -0.0028 -0.0014 3.5726 8.7818 35.9814 44.8436
frequency: -14.2531 35.9798 44.8413 111.1129 154.6726 155.1586 163.9103 175.7181 192.1854 227.4017 233.5644 275.1036 280.6757 346.3212 347.0386 365.4945 411.3512 432.7360 442.3415 477.4562 486.8518 494.9060 513.9791 550.6637 575.0236 633.0387 638.2889 718.7556 725.8076 751.4579 761.9571 772.0370 788.0077 857.2793 864.4732 881.7314 886.8919 913.1367 1008.6057 1066.9679 1081.9639 1112.9815 1141.4521 1173.7854 1177.1432 1192.3195 1254.8219 1281.2387 1305.4143 1332.8638 1363.4122 1389.0467 1422.3295 1470.3486 1505.0074 1546.2462 1581.1793 1604.2806 1630.9990 3122.1147 3162.0203 3168.4023 3185.2579 3186.8749 3524.3003 3623.4601
redmass: 6.2809 15.3496 10.0539 11.8622 10.2408 7.3606 11.3435 20.5133 4.7937 4.9429 14.8824 1.1423 5.1590 32.9679 7.3028 7.6838 8.1668 3.1144 7.2236 6.7401 1.1894 4.1357 5.0688 5.6298 3.8731 7.8170 4.6302 3.8551 5.9691 10.6326 6.6624 9.1258 1.4164 1.4442 1.3702 1.4659 6.4767 1.3411 3.4935 2.2965 1.7892 4.1233 1.2164 1.5990 1.2894 2.4989 1.8752 2.5265 1.7820 4.7320 4.5029 6.5789 3.0090 3.6859 3.6017 9.7814 8.8284 7.1566 6.8294 1.0896 1.0949 1.0934 1.0932 1.0941 1.0649 1.0666
irintensity: 1.5024 0.3793 1.5078 0.4069 0.5247 0.0023 1.2676 0.2921 0.0250 10.6046 0.3265 160.6456 6.0293 0.0313 0.0133 3.7491 5.5181 12.0313 4.9710 35.4071 110.6502 18.9471 0.0032 4.6598 12.4986 1.3207 10.7082 0.8067 7.4726 90.5310 8.1886 85.7058 29.8699 42.4090 0.0082 8.8162 29.7837 1.2973 8.9762 149.6718 98.6896 3.6197 10.5070 14.3164 147.1750 30.0399 24.8183 183.5576 19.1499 37.2671 22.8507 1.1819 143.3794 31.6151 58.7417 91.7108 96.0492 43.9633 2.9066 15.6409 6.2444 0.0500 2.5232 0.5590 92.9720 67.4174
temp: 298.150 k
press: 1.00000 atm
elementType: 17 17 17 8 8 6 6 6 6 6 6 6 6 6 6 6 6 1 1 1 1 1 1 1
symmnumber: 1
zpe: 408537.8 jmol-1
zpe.correction: 0.155604 hartree
zpe.thermalcorrener: 0.170469 hartree
zpe.thermalcorrenthalpy: 0.171413 hartree
zpe.thermalcorrgfe: 0.112772 hartree
zpe.sumelectzpe: -1990.903208 hartree
zpe.sumelectthermal: -1990.888343 hartree
zpe.sumelectthermalent: -1990.887399 hartree
zpe.sumelectthermalfe: -1990.946040 hartree
dipole: 2.2507 0.0046 -2.7685
dipole: 3.5679
quadrupole: -100.3611 -121.4106 -115.6466
quadrupole: 0.0210 -12.4113 -0.0120
quadrupole: 12.1117 -8.9379 -3.1738 0.0210 -12.4113 -0.0120
hfenergy: -1991.0588119 hartree
pointgroup: C01 [X(C12H7Cl3O2)]
dipole: -0.8742546 0.0028743 1.098232 debye
dipolederiv: -0.2703659 -0.2328573 0.0160625 -0.2492529 -0.637019 0.0205574 0.02017 0.0218357 -0.0431218 -0.2702568 0.2328097 0.0152929 0.249196 -0.6372989 -0.0187081 0.0194486 -0.0199757 -0.0430013 -0.9115785 0.0001918 0.0619078 0.0002048 -0.1316787 0.0001055 0.0646429 0.0000997 -0.0582153 -0.7621866 -0.0015907 -0.5998479 -0.002049 -0.3995597 -0.0012699 -0.7569724 -0.0012559 -0.8731589 -1.6030148 0.0003053 0.1187066 0.000244 -0.4227001 0.0007939 0.099796 0.0007877 -0.1324925 0.1840909 0.0001314 0.0634378 -0.0003677 -0.0398631 0.0004483 -0.1061974 0.0003206 0.119302 0.3246551 -0.0001236 -0.022296 -0.0001252 -0.5014697 0.0006327 -0.0279242 0.0006817 -0.0342516 -0.1966057 -0.0005923 -0.2333823 0.0005814 -0.1017082 0.0002442 0.133127 0.0002261 -0.0147402 -0.2061389 -0.0000735 -0.0266135 -0.0002384 -0.1147196 0.0003523 -0.0284337 0.0002877 -0.0131617 0.3879626 0.3250723 -0.0292556 0.2551437 0.9824481 -0.024067 -0.0276007 -0.026682 -0.0399453 0.387833 -0.3249904 -0.0281528 -0.2550743 0.9827705 0.0208444 -0.0269846 0.0235539 -0.0400785 0.4305573 0.0015178 0.5739964 0.0025427 0.0748033 0.0018767 0.9556697 0.0018718 0.7658628 -0.1168293 0.0000891 0.0268798 -0.0001577 -0.1495862 0.0005533 -0.0747666 0.0005546 0.0458282 1.3473726 -0.000217 -0.0871661 -0.0010986 0.0092102 -0.000406 -0.4238718 -0.0004093 -0.1365595 -0.5447177 -0.1594741 0.03379 -0.0996767 -0.2758821 0.0080541 0.0316425 0.0139965 -0.082081 -0.5446871 0.1596259 0.0332786 0.0998775 -0.276031 -0.0074332 0.031172 -0.0134451 -0.0820018 1.3662334 -0.0002825 -0.1029499 -0.000327 0.3240496 -0.0005473 -0.1062485 -0.0005329 -0.0426882 0.0986454 0.0001524 0.0555326 0.0001811 0.1417393 -0.0004015 0.0682587 -0.0003713 -0.0002343 0.0428117 -0.0002433 -0.0881654 -0.0002621 0.1383324 -0.0004225 -0.0964485 -0.000381 -0.0082669 -0.022532 0.0002696 0.1014249 0.0002998 0.1640611 -0.0006012 0.0989831 -0.0005805 -0.0494122 0.0660421 0.0312827 0.0077438 0.0325411 0.0465711 -0.0021996 0.0073633 -0.002271 0.1702485 0.0660276 -0.0312663 0.0078427 -0.0325247 0.0466016 0.0025702 0.0074972 0.0026423 0.1702323 0.3055843 0.0003826 0.1446325 0.0003451 0.37993 -0.0001458 0.1382812 -0.0001337 0.3292289 0.4410973 -0.0001196 -0.0426996 -0.000003 0.3969992 -0.0008312 -0.0006037 -0.0008202 0.0927085 unknown
polarizability: 246.7386564|-0.0075051|141.4718259|-5.3629794|0.008975|111.0405187 unknown
InChI: InChI=1S/C12H7Cl3O2/c13-7-4-8(14)12(9(15)5-7)6-1-2-10(16)11(17)3-6/h1-5,16-17H
charge 0 multiplicity 1
24 atoms
Cl 0.767716 -2.800181 0.104616
Cl 0.768495 2.800742 0.096138
Cl 5.524166 -0.000923 -0.263589
O  -3.610975 -0.005435 -2.016445
O  -4.849549 0.001016 0.37711
C  -0.625422 0.000625 0.207093
C  0.869375 0.000254 0.09344
C  -1.421546 -0.002563 -0.964881
C  -1.243317 0.004093 1.481231
C  1.627008 -1.199552 0.036299
C  1.627347 1.199671 0.032729
C  -2.823324 -0.002297 -0.861561
C  -2.653379 0.004365 1.588802
C  -3.435682 0.001167 0.420506
C  3.03203 -1.23068 -0.071436
C  3.032377 1.230089 -0.075102
C  3.711581 -0.000469 -0.125383
H  -0.970253 -0.005253 -1.961273
H  -0.629682 0.006577 2.387129
H  -3.130435 0.007068 2.576915
H  3.570885 -2.179911 -0.112039
H  3.571489 2.179044 -0.118597
H  -4.56948 -0.004773 -1.753494
H  -5.249724 0.003429 1.278893
