program: Gaussian 09
title: 000185740
version: EM64L-G09RevD.01
frameworkgroup: C1[X(C12H12O4)]
method: RPBEPBE
basis: SDD
operation: Freq
keyword: #pfreq=noraman
keyword: PBEPBE/SDD
title: #p freq=noraman PBEPBE/SDD
converged: NO NO NO NO
title: Mulliken charges:
elementType: O O O O C C C C C C C C C C C C H H H H H H H H H H H H
charge: -0.259212 -0.271680 -0.256597 -0.213924 0.091981 0.442038 0.203798 0.323450 -0.600828 -0.536299 0.368523 -0.793317 -0.478970 0.120102 -0.536908 -0.534925 0.259360 0.282643 0.241098 0.223936 0.241169 0.254341 0.237109 0.237114 0.249785 0.229039 0.229052 0.248121
chargesum: 0.00000
title: Mulliken charges with hydrogens summed into heavy atoms:
elementType: O O O O C C C C C C C C C C C C
charge: -0.259212 -0.271680 -0.256597 -0.213924 0.091981 0.442038 0.203798 0.323450 -0.341468 -0.253656 0.368523 -0.087113 -0.224629 0.120102 0.187100 0.171287
polarizability: 2.23361152e+02 9.10989940e+00 1.75141653e+02 -8.47025792e-03 4.99633582e-03 7.13272440e+01
1716.lowfreq: -11.3940 -6.9371 -3.5360 -0.0012 -0.0007 -0.0007 43.0560 85.1169 106.4205
frequency: 42.9929 85.1152 106.4136 129.1206 155.5640 170.5325 201.2492 203.9546 210.5079 234.4117 256.7655 262.3953 274.2021 309.3415 321.9594 374.0344 393.5681 439.4392 496.1539 521.1111 547.5010 558.2347 597.8835 605.6867 652.7094 661.5637 698.4401 702.8647 749.3001 790.1932 825.5689 846.8196 875.1146 919.0587 924.8600 988.4165 1020.3998 1048.2563 1053.9878 1100.3285 1108.8555 1114.1266 1129.8625 1144.3747 1163.6256 1187.5570 1216.7663 1235.2100 1303.9592 1374.9235 1380.5912 1403.2073 1426.1441 1434.0711 1440.9756 1462.0645 1467.8578 1468.2383 1468.3810 1473.2668 1477.6875 1487.6418 1543.8284 1591.2186 1620.3378 1698.7154 2969.4398 2976.8591 2996.2533 3060.8880 3073.2702 3085.7911 3095.0858 3133.8719 3137.2802 3161.2161 3185.6449 3199.5848
redmass: 3.6307 5.2144 3.6951 3.7289 4.0152 2.7839 1.7239 3.7647 1.3956 1.5837 1.4014 2.3303 4.6758 3.4578 4.9646 5.1982 6.7038 6.3557 4.7607 7.0038 3.4410 5.7517 5.8632 5.0007 3.0234 4.8040 8.7940 4.8359 3.6697 6.3638 1.5699 1.5836 1.5209 7.2767 7.8248 2.3834 5.6403 1.5461 2.0568 5.6968 1.2615 1.2591 2.2523 1.5589 1.5864 2.5986 1.7636 1.4429 5.9639 2.4956 5.7217 1.2826 1.4678 2.1374 1.2797 1.0463 1.0503 1.2278 1.0496 1.0635 1.2748 2.2253 7.9048 8.7263 6.6365 10.6741 1.0326 1.0319 1.0360 1.1043 1.1048 1.0969 1.1012 1.1003 1.1012 1.0919 1.0920 1.0903
irintensity: 3.6575 1.4981 2.0836 5.5277 2.7060 6.4222 0.0907 7.5937 0.8821 0.3494 0.5597 1.2022 1.1855 3.4939 2.2601 5.9873 0.6796 16.0790 4.9490 1.7356 0.1750 5.2888 0.2873 1.1156 4.1079 1.4522 11.0504 1.1196 2.8983 66.8555 51.1579 24.4422 34.5215 18.9742 44.5737 34.2083 55.8486 10.1041 70.5165 20.3808 0.0622 0.1241 145.4252 32.5502 48.1941 84.2006 56.6084 43.8034 117.2694 184.2696 12.6677 34.7533 5.4761 3.0931 15.3491 13.8407 13.1620 104.1059 15.6265 36.7546 30.4191 0.9873 9.6810 173.0641 470.5403 630.1927 59.0517 41.6297 21.4714 39.8767 29.2965 13.2948 24.8069 22.3021 14.2735 4.5026 1.4570 1.0693
temp: 298.150 k
press: 1.00000 atm
elementType: 8 8 8 8 6 6 6 6 6 6 6 6 6 6 6 6 1 1 1 1 1 1 1 1 1 1 1 1
symmnumber: 1
zpe: 563768.3 jmol-1
zpe.correction: 0.214728 hartree
zpe.thermalcorrener: 0.229620 hartree
zpe.thermalcorrenthalpy: 0.230565 hartree
zpe.thermalcorrgfe: 0.173360 hartree
zpe.sumelectzpe: -764.187972 hartree
zpe.sumelectthermal: -764.173079 hartree
zpe.sumelectthermalent: -764.172135 hartree
zpe.sumelectthermalfe: -764.229339 hartree
dipole: -0.3394 -4.5256 0.0104
dipole: 4.5383
quadrupole: -67.3043 -107.3466 -94.8852
quadrupole: -21.0088 -0.0031 0.0054
quadrupole: 22.5411 -17.5012 -5.0398 -21.0088 -0.0031 0.0054
hfenergy: -764.4026995 hartree
pointgroup: C01 [X(C12H12O4)]
dipole: 0.3662812 1.7436786 0.1162172 debye
polarizability: 223.5820073|1.8117902|173.3745714|14.3003298|4.7221112|72.8734707 unknown
InChI: InChI=1S/C12H12O4/c1-7-4-8(14-2)5-10-12(7)9(15-3)6-11(13)16-10/h4-6H,1-3H3
charge 0 multiplicity 1
28 atoms
O  -0.428986 -1.95215 -0.287735
O  -2.198528 1.870266 -0.283897
O  3.987733 -0.044219 0.206704
O  -2.488644 -2.970355 -0.529305
C  -0.201651 0.517728 -0.158115
C  0.706717 1.631683 -0.02437
C  0.352542 -0.802655 -0.164383
C  -1.653199 0.592968 -0.290488
C  2.08148 1.372136 0.091538
C  1.735018 -1.051955 -0.046293
C  2.601086 0.049218 0.081984
C  0.26226 3.084856 0.000129
C  -2.437862 -0.548446 -0.414986
C  -1.888932 -1.882769 -0.422853
C  -3.657524 2.0106 -0.411591
C  4.580669 -1.387737 0.205375
H  2.791613 2.198113 0.193947
H  2.072328 -2.090336 -0.060298
H  -0.435423 3.281774 0.831666
H  1.14036 3.743079 0.111834
H  -0.272331 3.361744 -0.924218
H  -3.522889 -0.495542 -0.514276
H  -4.176819 1.512425 0.427988
H  -4.011476 1.596369 -1.373791
H  -3.837835 3.094346 -0.377777
H  4.373587 -1.913504 -0.746203
H  4.203925 -1.989866 1.054023
H  5.662083 -1.223173 0.314294
