program: Gaussian 09
title: 000185736
version: EM64L-G09RevD.01
frameworkgroup: C1[X(C26H16)]
method: RPBEPBE
basis: SDD
operation: Freq
keyword: #p
keyword: freq=noraman
keyword: PBEPBE/SDD
title: #p freq=noraman PBEPBE/SDD
converged: YES YES NO NO
title: Mulliken charges:
elementType: C C C C C C C C C C C C C C C C C C C C C C C C C C H H H H H H H H H H H H H H H H
charge: 0.035873 0.093049 0.192166 0.204338 0.160398 0.130667 0.182727 0.430511 0.158901 -0.409258 -0.513711 0.391845 -0.368924 -0.477792 -0.357994 -0.390327 -0.388382 -0.490072 -0.356351 -0.271744 -0.275738 -0.453520 -0.275489 -0.268620 -0.256047 -0.251907 0.231132 0.240308 0.288475 0.241908 0.229023 0.229502 0.228762 0.238663 0.276427 0.232313 0.230138 0.239535 0.229343 0.230412 0.230357 0.229101
chargesum: 0.00000
title: Mulliken charges with hydrogens summed into heavy atoms:
elementType: C C C C C C C C C C C C C C C C C C C C C C C C C C
charge: 0.035873 0.093049 0.192166 0.204338 0.160398 0.130667 0.182727 0.430511 0.158901 -0.178126 -0.273403 0.391845 -0.080449 -0.235885 -0.128971 -0.160825 -0.159620 -0.251408 -0.079924 -0.039431 -0.045600 -0.213985 -0.046146 -0.038208 -0.025690 -0.022805
polarizability: 4.51881273e+02 1.47963962e+01 3.39063320e+02 -2.02125002e+01 1.31744244e+01 1.43864233e+02
1716.lowfreq: -4.8190 -0.0005 -0.0001 0.0006 2.4068 7.1449 41.9707 60.7147 80.3843
frequency: 41.9663 60.7039 80.3816 98.4948 102.9316 133.8494 175.0201 188.6507 231.2386 243.0291 260.8865 282.1408 314.7159 332.5285 389.6201 398.5427 414.8160 426.0377 431.5788 454.1841 471.2410 479.8448 512.5431 524.9516 541.0032 553.3524 569.0697 588.7660 603.2986 616.4714 622.4979 641.0930 663.6211 684.9965 723.0148 730.3524 738.5940 745.2948 756.2364 762.5191 766.3758 789.6573 792.6090 799.5350 809.2902 851.0567 858.9667 870.7416 871.9691 880.8740 916.4635 951.1190 955.4780 959.8137 963.0417 980.3785 986.2157 988.2511 990.5167 991.8105 993.5620 1033.5141 1046.4485 1054.0483 1066.6501 1091.0913 1110.0922 1143.2010 1154.5658 1168.0161 1175.8768 1179.3942 1185.8478 1221.4995 1230.6415 1235.5735 1252.8653 1260.1278 1281.1017 1288.7876 1315.3234 1327.3207 1358.3928 1379.7858 1385.7105 1392.2155 1403.6814 1414.5376 1418.0285 1437.7883 1442.3352 1444.2431 1475.4647 1481.9324 1508.0735 1517.1795 1544.9092 1565.1146 1581.5431 1598.7497 1612.4435 1613.6486 1616.4904 1625.1790 3119.7968 3121.5134 3128.0582 3129.4528 3130.4220 3135.4858 3141.7359 3145.4176 3146.8030 3155.4619 3156.5714 3161.8210 3165.3342 3171.3210 3177.0955 3178.2611
redmass: 5.3692 4.4283 4.8627 4.2967 4.1586 4.3823 4.0153 4.9895 4.8557 4.9203 4.5297 4.7753 4.8395 4.9884 5.1936 5.4037 4.0234 3.6040 4.8739 4.4082 3.6989 3.7518 5.1241 4.3198 3.3693 4.6692 3.2968 5.5342 4.0691 6.6935 6.1635 3.4928 5.9677 5.8937 3.0878 3.8217 3.4217 5.0483 1.2927 1.9749 1.4598 2.0561 4.6041 4.1546 1.5758 1.6422 5.1977 1.5392 1.5798 1.5528 5.2326 1.4110 1.3543 1.3695 1.3956 1.4110 1.7364 2.2917 1.3396 1.7411 5.1878 2.9388 2.2156 2.2784 2.3394 2.8006 2.2748 1.6226 1.3160 1.2483 1.0939 1.0944 1.1043 1.6200 2.4170 1.5994 2.0431 1.8753 1.9459 1.7073 2.2108 2.7246 4.7439 3.9215 7.8606 5.9428 2.7416 3.1905 3.1571 2.7172 2.4649 2.4149 3.0335 2.7656 3.4006 3.8259 4.6891 7.4825 7.6573 6.5710 6.0949 5.7990 6.4200 6.6385 1.0864 1.0863 1.0856 1.0869 1.0859 1.0900 1.0898 1.0984 1.0902 1.0954 1.0968 1.0969 1.0946 1.0967 1.0963 1.0960
irintensity: 0.0954 0.1196 0.1075 0.9371 0.4944 2.6136 0.2145 1.0969 0.6426 0.7111 0.6503 1.2450 0.5997 0.0969 1.6327 2.1610 1.2271 4.4287 0.8814 3.1201 5.0060 0.4796 0.6912 7.6948 6.5558 2.0995 0.7726 0.9106 1.1695 6.1218 9.4342 6.4585 1.4929 0.4443 9.8059 6.4216 11.6636 5.3227 96.8746 41.8046 58.8487 7.4836 1.5537 0.3967 10.3864 68.4771 3.6567 0.2461 1.4724 19.9673 1.4952 0.8896 0.3735 1.5259 4.5514 0.5789 0.2858 0.6387 0.2884 0.3634 1.2741 5.3962 9.7001 4.6388 3.1089 1.4563 3.5815 4.3303 1.3470 2.5123 1.7478 0.6659 1.7149 2.8484 0.4342 12.3172 9.7651 3.0268 1.5769 0.5310 0.8153 6.1887 6.3655 5.0430 1.0088 1.8496 2.6928 2.5393 2.5840 19.0952 8.1207 6.1279 6.1913 15.4897 6.6279 3.0007 0.9882 0.3937 0.0905 0.1493 1.1782 1.6639 0.1521 0.8928 1.7916 2.9743 2.3318 2.0764 5.5657 10.8984 21.5421 40.9788 2.3110 1.3673 43.4419 11.8938 57.7203 45.9455 7.3414 12.0653
temp: 298.150 k
press: 1.00000 atm
elementType: 6 6 6 6 6 6 6 6 6 6 6 6 6 6 6 6 6 6 6 6 6 6 6 6 6 6 1 1 1 1 1 1 1 1 1 1 1 1 1 1 1 1
symmnumber: 1
zpe: 864671.5 jmol-1
zpe.correction: 0.329336 hartree
zpe.thermalcorrener: 0.347127 hartree
zpe.thermalcorrenthalpy: 0.348071 hartree
zpe.thermalcorrgfe: 0.284447 hartree
zpe.sumelectzpe: -998.723892 hartree
zpe.sumelectthermal: -998.706101 hartree
zpe.sumelectthermalent: -998.705157 hartree
zpe.sumelectthermalfe: -998.768781 hartree
dipole: 0.0343 -0.0307 0.0733
dipole: 0.0866
quadrupole: -127.7944 -129.4553 -155.5697
quadrupole: -0.4172 -4.2776 2.8750
quadrupole: 9.8121 8.1512 -17.9632 -0.4172 -4.2776 2.8750
hfenergy: -999.0532281 hartree
pointgroup: C01 [X(C26H16)]
dipole: -0.013756 -0.0124319 -0.0285783 debye
polarizability: 451.4689464|-15.1559174|338.7255995|-23.0225802|-15.2907163|144.6142805 unknown
InChI: InChI=1S/C26H16/c1-2-8-19-17(7-1)13-14-18-15-16-24-22-11-4-3-9-20(22)21-10-5-6-12-23(21)26(24)25(18)19/h1-16H
charge 0 multiplicity 1
42 atoms
C  0.131401 -0.381181 0.230576
C  -1.263349 -0.808743 0.199009
C  1.15732 -1.380234 0.183793
C  0.562842 1.015473 0.448334
C  2.53872 -0.999369 -0.152183
C  1.927628 1.399484 0.199915
C  2.899939 0.388154 -0.23787
C  -1.559783 -2.163248 0.587351
C  -2.386129 0.008748 -0.284825
C  0.814496 -2.746169 0.461635
C  -0.493695 -3.10577 0.7521
C  -3.742561 -0.444326 -0.06202
C  -0.305433 1.973415 1.0605
C  -2.924233 -2.585873 0.793874
C  3.521534 -1.982008 -0.481629
C  2.326138 2.744652 0.464911
C  4.207977 0.73556 -0.687497
C  -3.981231 -1.734327 0.538445
C  -2.21188 1.185066 -1.085111
C  0.112202 3.283011 1.329331
C  1.435276 3.68314 1.002622
C  -4.844748 0.350517 -0.511588
C  4.809608 -1.619253 -0.900658
C  5.154031 -0.246562 -1.014305
C  -3.304475 1.927839 -1.548115
C  -4.636639 1.529828 -1.232838
H  1.59941 -3.505623 0.50824
H  -0.735775 -4.129313 1.060378
H  -1.315228 1.66994 1.344045
H  -3.100677 -3.604686 1.158079
H  3.265096 -3.044367 -0.445409
H  3.36259 3.046373 0.288039
H  4.48388 1.78865 -0.79478
H  -5.015394 -2.048742 0.720608
H  -1.2028 1.502896 -1.356429
H  -0.576364 3.988145 1.807113
H  1.770314 4.706086 1.20596
H  -5.862746 -0.002511 -0.307275
H  5.539867 -2.393808 -1.158847
H  6.150655 0.044615 -1.363183
H  -3.132028 2.816489 -2.165116
H  -5.486654 2.126133 -1.581878
