program: Gaussian 09
title: 000186193
version: EM64L-G09RevD.01
frameworkgroup: C1[X(C11H16ClO2PS2)]
method: RPBEPBE
basis: SDD
operation: Freq
keyword: #p
keyword: freq=noraman
keyword: PBEPBE/SDD
title: #p freq=noraman PBEPBE/SDD
converged: YES YES NO NO
title: Mulliken charges:
elementType: Cl S S P O O C C C C C C C C C C C H H H H H H H H H H H H H H H H
charge: -0.054372 0.051544 -0.198202 0.529413 -0.498868 -0.474914 -0.594811 -0.336338 -0.666266 0.356999 -0.214869 -0.334101 -0.300395 -0.653884 -0.175407 -0.177956 -0.110499 0.292439 0.272617 0.221478 0.217678 0.216784 0.226568 0.212306 0.220671 0.240350 0.263221 0.277393 0.216674 0.230746 0.228433 0.259394 0.256171
chargesum: 0.00000
title: Mulliken charges with hydrogens summed into heavy atoms:
elementType: Cl S S P O O C C C C C C C C C C C
charge: -0.054372 0.051544 -0.198202 0.529413 -0.498868 -0.474914 -0.029755 0.102819 -0.010607 0.356999 0.246152 -0.070880 -0.023003 0.021970 0.083987 0.078216 -0.110499
polarizability: 2.73816541e+02 -1.19304713e+01 1.75601493e+02 -7.74844424e-01 -9.63842543e+00 1.80985654e+02
1716.lowfreq: -10.4370 -5.6216 0.0018 0.0022 0.0025 6.6124 9.5702 21.6344 27.2324
frequency: -5.3759 21.4835 26.4719 31.3126 43.0354 52.9601 66.4090 75.1009 100.4111 107.2106 113.0288 143.5465 168.8999 183.0984 199.9396 224.1115 243.5824 249.6282 281.8351 294.8545 302.4151 333.3954 366.3500 386.4768 410.8430 414.4622 442.4719 497.2893 527.7360 598.8999 620.7047 661.2795 671.6303 679.7938 698.2299 750.8971 810.8753 815.5218 816.3723 835.4879 859.8985 864.9839 898.9712 945.6976 958.3040 996.0976 1020.0361 1041.8733 1060.9954 1066.0981 1096.6426 1100.7794 1102.4311 1134.5158 1152.3432 1181.3884 1216.7553 1250.7595 1255.4527 1281.2935 1286.3347 1331.4870 1354.1071 1365.2774 1389.8449 1392.2806 1394.0857 1456.6689 1458.5557 1462.3916 1474.4215 1476.6537 1476.9851 1485.4212 1489.9076 1584.5883 1588.5814 2981.1242 2986.7156 2994.5288 2995.0592 3042.0846 3044.5740 3052.4509 3081.1559 3083.5794 3091.5783 3106.9833 3127.5021 3162.3533 3163.8175 3181.1821 3184.6010
redmass: 3.9729 3.8461 4.9423 3.6585 1.7459 5.4682 6.2537 2.1276 6.4546 4.4940 4.4248 6.3197 8.2639 7.4266 3.3225 1.1077 2.8009 1.9516 6.7214 6.4120 4.4771 4.4259 8.6790 8.7173 6.6072 2.9798 7.0631 6.1615 4.8201 9.7928 7.2496 8.0438 5.7986 8.6427 3.7555 1.0784 1.1205 1.6265 2.8412 1.5694 1.1809 3.7907 1.9297 1.3434 1.3577 4.2690 2.5996 3.0234 1.1776 2.5538 1.3091 2.1406 2.2157 1.4357 1.8455 1.7906 1.3915 1.1920 1.1341 1.2450 1.1003 1.3971 1.2640 6.3683 1.1984 3.6584 1.2465 1.0945 1.0421 2.2882 1.0511 1.0431 1.0489 1.0810 1.0807 7.1668 7.1336 1.0351 1.0554 1.0597 1.0374 1.0749 1.0831 1.1075 1.1015 1.0996 1.0983 1.1023 1.1094 1.0892 1.0891 1.0969 1.0981
irintensity: 0.3398 0.2732 0.2415 0.0350 0.3048 0.0111 0.1786 1.6236 1.4819 0.3640 0.9740 1.8502 0.6034 2.0269 4.0363 0.0038 3.6961 1.2021 6.8651 9.4574 3.9628 4.1400 21.5066 5.4837 3.2592 0.5161 43.1428 39.7742 45.7221 110.0387 3.7375 108.0689 18.8777 115.1591 1.4303 7.6020 1.3133 22.1713 46.8410 85.1422 2.7489 117.0238 11.6438 0.9401 0.2909 67.6252 104.6694 7.3654 1.9226 54.7525 10.6802 32.2713 14.8797 2.8918 63.6596 74.0698 0.0097 4.4625 0.4497 0.2664 0.1347 5.3400 8.0384 0.2069 10.1260 2.2638 28.7145 26.8419 13.5172 178.3346 4.0672 17.6434 3.0388 13.9064 10.5163 0.5070 0.8277 35.2120 29.7933 21.0722 21.4052 6.5302 6.2859 8.6929 46.2933 42.5316 28.0999 33.7997 15.2228 2.0681 2.2730 1.8636 0.2337
temp: 298.150 k
press: 1.00000 atm
elementType: 17 16 16 15 8 8 6 6 6 6 6 6 6 6 6 6 6 1 1 1 1 1 1 1 1 1 1 1 1 1 1 1 1
symmnumber: 1
zpe: 654956.9 jmol-1
zpe.correction: 0.249460 hartree
zpe.thermalcorrener: 0.269839 hartree
zpe.thermalcorrenthalpy: 0.270783 hartree
zpe.thermalcorrgfe: 0.196581 hartree
zpe.sumelectzpe: -2175.319704 hartree
zpe.sumelectthermal: -2175.299325 hartree
zpe.sumelectthermalent: -2175.298380 hartree
zpe.sumelectthermalfe: -2175.372583 hartree
dipole: 2.9305 -1.0456 3.3745
dipole: 4.5900
quadrupole: -132.7912 -129.0219 -127.6038
quadrupole: -3.9431 9.3392 9.6583
quadrupole: -2.9856 0.7837 2.2019 -3.9431 9.3392 9.6583
hfenergy: -2175.5691639 hartree
pointgroup: C01 [X(C11H16Cl1O2P1S2)]
dipole: -1.2759158 -0.600931 -1.1278206 debye
polarizability: 247.1661877|44.5601145|195.1993607|-15.9657083|-1.6716635|188.0381396 unknown
InChI: InChI=1S/C11H16ClO2PS2/c1-3-9-17-15(16,13-4-2)14-11-7-5-10(12)6-8-11/h5-8H,3-4,9H2,1-2H3
charge 0 multiplicity 1
33 atoms
Cl 5.1815 1.647189 -1.526167
S  -2.599938 -1.331893 2.032408
S  -0.882605 1.840699 2.788499
P  -1.249509 0.361633 1.407744
O  0.08717 -0.611802 0.778021
O  -1.855002 0.885161 -0.151531
C  -2.560044 -2.36246 0.417096
C  -3.493283 -3.573487 0.589848
C  -3.494061 -4.446485 -0.687645
C  1.259137 -0.005018 0.247926
C  -2.842293 2.005491 -0.17651
C  2.453971 -0.108561 0.99331
C  1.240318 0.599949 -1.029835
C  -3.089532 2.323446 -1.648493
C  3.657517 0.39339 0.450902
C  2.441312 1.106999 -1.57166
C  3.630274 0.994263 -0.823137
H  -1.513639 -2.663229 0.256153
H  -2.886942 -1.700901 -0.40139
H  -3.162694 -4.18013 1.454371
H  -4.522061 -3.229217 0.808841
H  -2.479019 -4.820064 -0.916135
H  -4.156612 -5.320982 -0.558918
H  -3.8522 -3.874878 -1.563708
H  -3.76827 1.675938 0.333242
H  -2.41788 2.868291 0.370237
H  2.435101 -0.578323 1.980707
H  0.297277 0.671923 -1.578869
H  -3.828873 3.141304 -1.732143
H  -2.156954 2.646991 -2.141337
H  -3.483828 1.442156 -2.182523
H  4.59351 0.321203 1.011577
H  2.451054 1.577203 -2.559076
