program: Gaussian 09
title: 000185695
version: EM64L-G09RevD.01
frameworkgroup: C1[X(C7H3Br3O2)]
method: RPBEPBE
basis: SDD
operation: Freq
keyword: #p
keyword: freq=noraman
keyword: PBEPBE/SDD
title: #p freq=noraman PBEPBE/SDD
converged: NO NO NO NO
title: Mulliken charges:
elementType: Br Br Br O O C C C C C C C H H H
charge: 0.105232 0.149098 0.158202 -0.143794 -0.133668 0.467902 -0.575276 0.201560 -0.329571 0.412982 -0.328641 -0.745473 0.262019 0.261982 0.237446
chargesum: 0.00000
title: Mulliken charges with hydrogens summed into heavy atoms:
elementType: Br Br Br O O C C C C C C C
charge: 0.105232 0.149098 0.158202 -0.143794 -0.133668 0.467902 -0.575276 0.201560 -0.329571 0.412982 -0.328641 0.015973
polarizability: 1.88540728e+02 1.62983832e+01 1.79008247e+02 -1.44393223e-02 -1.32539792e-02 4.90079071e+01
1716.lowfreq: -16.1831 0.0004 0.0006 0.0007 3.4559 4.3986 9.7943 42.1785 52.1604
frequency: -15.6816 42.1748 52.1374 85.9654 125.4876 137.7336 174.6353 188.1754 230.5791 260.6550 296.1624 314.9759 348.2426 403.9941 436.5823 477.2717 535.3264 638.2185 669.2313 715.0683 783.2450 812.8295 837.7450 960.9922 1024.9875 1032.9107 1109.6327 1177.1369 1252.0220 1396.2910 1444.0461 1450.5607 1539.5333 1548.9658 1563.5829 1611.7852 2998.8313 3072.9060 3137.2823
redmass: 1.1464 6.3521 9.8144 6.1968 64.1464 34.3075 7.9080 49.8367 6.7555 11.5112 7.1329 9.6194 5.2606 8.1211 9.3272 9.7139 6.9696 9.5255 6.4813 8.7054 10.2070 8.8650 6.2574 5.8266 2.4127 1.5436 5.3777 9.6189 6.6360 1.2213 1.1034 1.0439 11.9955 10.4733 12.9328 7.8158 1.0385 1.0957 1.0991
irintensity: 0.8787 0.4914 2.7248 2.4397 0.2233 0.1778 0.3546 0.0525 1.2174 0.8966 0.0056 0.8022 1.7338 0.0025 10.1765 16.2730 0.1026 103.6157 0.1123 20.2327 36.3442 2.0239 1.2543 177.9157 39.1318 3.8544 135.7642 50.0099 109.3302 51.9167 2.0158 16.3281 187.0232 144.7044 197.4201 33.1521 1.1316 4.5507 6.6156
temp: 298.150 k
press: 1.00000 atm
elementType: 35 35 35 8 8 6 6 6 6 6 6 6 1 1 1
symmnumber: 1
zpe: 208676.0 jmol-1
zpe.correction: 0.079480 hartree
zpe.thermalcorrener: 0.091286 hartree
zpe.thermalcorrenthalpy: 0.092230 hartree
zpe.thermalcorrgfe: 0.037924 hartree
zpe.sumelectzpe: -458.471575 hartree
zpe.sumelectthermal: -458.459770 hartree
zpe.sumelectthermalent: -458.458826 hartree
zpe.sumelectthermalfe: -458.513131 hartree
dipole: -0.6604 1.4385 -0.0010
dipole: 1.5829
quadrupole: -89.5772 -104.3640 -94.9723
quadrupole: -10.0952 0.0022 0.0070
quadrupole: 6.7273 -8.0595 1.3322 -10.0952 0.0022 0.0070
hfenergy: -458.5510555 hartree
pointgroup: C01 [X(C7H3Br3O2)]
dipole: -0.339254 0.5222333 -0.0003926 debye
dipolederiv: -0.6828949 -0.2976854 0.0001269 -0.2761206 -0.0808232 0.0000408 0.0001571 0.0000617 0.0392641 -0.5430439 -0.3707912 -0.0000156 -0.2818346 -0.0738981 0.0000078 -0.0001 -0.0000346 0.0689794 -0.3269599 0.4191577 0.000027 0.3742502 -0.2871636 -0.0000313 0.0000295 -0.0000068 0.0751566 -0.5599131 -0.0397411 0.0000447 -0.0400341 -1.046606 0.0000484 0.0000193 0.0001281 -0.2732816 -0.4966837 -0.085985 -0.0000344 -0.1609157 -0.863024 -0.0003181 0.0001657 0.0004707 -0.2732106 -0.6163359 -0.6750106 0.0000264 -0.5872311 0.0903942 0.000167 0.0000585 -0.0001318 0.0615952 0.7870957 0.8386446 -0.0001611 0.9959641 -0.031637 -0.0000847 -0.0000864 0.0000606 -0.1748217 1.2483228 -0.0563962 -0.0001837 -0.2540013 1.1590728 -0.000106 -0.0001723 -0.0000271 0.2140241 0.4556035 1.1143 0.0001947 1.0771623 -0.2257296 0.0000564 0.0002955 -0.0001323 -0.0895673 0.9425153 0.1336588 0.0000119 0.052486 0.9084635 0.0001264 -0.0000527 -0.0004795 0.318092 -0.2346204 -1.0750634 -0.0001068 -0.9644784 0.4466876 0.0001112 -0.0003797 0.0001591 -0.1092701 -0.1088563 0.084443 0.0001274 0.1662009 -0.2392316 0.0000077 0.0000778 -0.0001552 0.0163495 0.0927776 0.0052002 0.0452576 0.0002636 0.077598 0.0760699 0.0116349 0.0713797 0.004926 0.0927807 0.0054328 -0.0451861 0.0003352 0.0776574 -0.0759803 -0.0115516 -0.0712889 0.0045553 -0.0497872 -0.0001642 -0.0001288 -0.1020465 0.0882396 -0.000115 -0.0000957 -0.0000037 0.1172091 unknown
polarizability: 183.6570392|16.9805934|183.8919353|-0.0123619|-0.01521|49.0079071 unknown
InChI: InChI=1S/C7H3Br3O2/c1-2-3(8)7(12)5(10)4(9)6(2)11/h1H3
charge 0 multiplicity 1
15 atoms
Br -3.155698 -1.249039 0.000583
Br 3.11238 1.282281 0.000054
Br 2.549546 -2.178522 -0.000036
O  0.403725 2.707358 -0.000528
O  -0.461791 -2.680733 0.001025
C  -1.19768 0.9178 -0.000075
C  -1.385593 -0.44123 0.000025
C  0.210037 1.458247 -0.000075
C  1.356248 0.485803 -0.000139
C  -0.261419 -1.437622 -0.000535
C  1.136411 -0.867857 -0.000132
C  -2.279456 1.965217 0.000119
H  -2.169328 2.622672 -0.881273
H  -2.170194 2.621359 0.882624
H  -3.282189 1.515967 -0.000639
