program: Gaussian 09
title: 000185668
version: EM64L-G09RevD.01
frameworkgroup: C1[X(C11H16N2O)]
method: RPBEPBE
basis: SDD
operation: Freq
keyword: #p
keyword: freq=noraman
keyword: PBEPBE/SDD
title: #p freq=noraman PBEPBE/SDD
converged: YES YES NO YES
title: Mulliken charges:
elementType: O N N C C C C C C C C C C C H H H H H H H H H H H H H H H H
charge: -0.317612 -0.508070 -0.165742 0.385248 0.330810 0.503418 -0.680995 -0.415310 -0.366341 -0.816333 -0.816386 0.297532 -0.631889 -0.670889 0.213438 0.226773 0.309592 0.320987 0.225895 0.224452 0.225878 0.221668 0.221598 0.230638 0.222382 0.222384 0.289824 0.247349 0.234881 0.234819
chargesum: 0.00000
title: Mulliken charges with hydrogens summed into heavy atoms:
elementType: O N N C C C C C C C C C C C
charge: -0.317612 -0.187083 -0.165742 0.385248 0.330810 0.503418 -0.467557 -0.188537 -0.056749 -0.140108 -0.142482 0.297532 0.102701 0.046160
polarizability: 2.18610099e+02 2.66646357e+00 1.39194375e+02 -3.27313976e-03 -3.10498242e-03 7.52318435e+01
1716.lowfreq: -0.0007 -0.0005 0.0006 5.0417 7.8736 16.3566 33.6079 50.2480 75.8632
frequency: 33.5911 50.2211 75.8338 110.4201 114.0140 115.7845 136.6103 158.7448 168.0192 213.9215 237.5323 238.7021 259.8044 295.3823 338.6520 374.1767 415.6249 447.2946 447.8682 515.1919 540.8804 589.4674 594.8300 611.5977 702.3507 722.1281 738.6574 765.0865 850.3872 857.3122 866.5215 924.3590 979.7664 988.5466 993.3776 1029.4415 1030.5253 1051.5651 1059.9868 1095.4706 1123.8500 1136.0938 1161.3757 1187.5695 1228.3253 1258.4741 1271.6591 1308.4411 1333.6543 1371.8522 1392.7699 1400.5574 1409.5600 1418.7353 1449.1620 1461.1484 1467.3511 1475.0345 1479.5507 1480.5610 1482.5292 1494.2851 1496.6878 1506.7923 1519.8092 1595.0966 1620.9570 1631.8865 2935.0398 2963.3016 2963.8593 2969.1936 3001.2529 3033.0373 3036.5956 3042.4973 3078.5675 3081.0884 3091.6710 3096.8503 3115.8395 3122.0509 3195.4694 3549.9278
redmass: 2.9929 3.6987 1.7571 3.8474 1.1389 2.0953 1.9216 1.1334 1.2617 2.2437 4.1624 2.5484 4.0380 2.7074 3.4832 4.0797 3.0938 2.7976 3.2330 4.3587 1.3518 5.6128 2.6496 4.7660 11.2466 2.6397 4.8396 4.8076 1.2838 6.2115 1.5546 3.2642 1.3151 1.7132 1.5956 1.4371 1.9369 1.6319 1.4211 1.2346 1.9399 1.3255 1.9708 1.9469 1.7681 5.3939 1.8395 2.0111 3.2054 4.5357 1.2428 1.8846 1.7764 1.1511 1.1786 1.0469 1.1274 1.0456 1.1913 1.0441 1.0946 1.0444 1.1724 2.6344 2.1219 5.8909 4.3296 6.0348 1.0385 1.0375 1.0371 1.0376 1.1018 1.0970 1.1024 1.0969 1.0983 1.0976 1.0905 1.0939 1.0961 1.0907 1.0943 1.0752
irintensity: 1.4607 0.8960 6.5108 3.1714 0.0006 1.1613 0.6297 1.7570 0.0286 0.0420 2.7044 10.4601 0.1586 0.0694 0.0071 23.7141 0.8448 6.8989 1.5249 0.1985 68.1464 4.8957 2.7784 0.2122 22.1701 1.5114 0.0374 0.4969 28.4125 2.3856 35.5042 1.8190 8.5643 35.4554 17.0459 14.3288 20.2814 0.0851 20.9617 0.0123 15.4857 0.1506 138.8594 78.9709 39.5830 11.7582 20.5031 47.1138 15.3635 179.0453 5.4954 76.9014 1.1255 36.6222 24.6162 0.0390 83.6152 29.8239 2.1861 24.1882 31.8346 4.0721 233.9379 87.4170 407.5346 40.6784 176.7854 115.0929 55.2779 154.9093 20.6449 32.6681 42.0748 36.7052 47.4821 12.8771 35.8082 4.5146 35.4010 18.5213 0.8424 21.3325 6.4872 9.0192
temp: 298.150 k
press: 1.00000 atm
elementType: 8 7 7 6 6 6 6 6 6 6 6 6 6 6 1 1 1 1 1 1 1 1 1 1 1 1 1 1 1 1
symmnumber: 1
zpe: 659020.7 jmol-1
zpe.correction: 0.251008 hartree
zpe.thermalcorrener: 0.266389 hartree
zpe.thermalcorrenthalpy: 0.267334 hartree
zpe.thermalcorrgfe: 0.208062 hartree
zpe.sumelectzpe: -612.460723 hartree
zpe.sumelectthermal: -612.445341 hartree
zpe.sumelectthermalent: -612.444397 hartree
zpe.sumelectthermalfe: -612.503669 hartree
dipole: 1.1321 4.5678 0.0005
dipole: 4.7059
quadrupole: -64.6294 -81.3715 -88.4508
quadrupole: 9.6438 -0.0003 -0.0002
quadrupole: 13.5212 -3.2210 -10.3002 9.6438 -0.0003 -0.0002
hfenergy: -612.7117307 hartree
pointgroup: C01 [X(C11H16N2O1)]
dipole: -0.4271752 1.8015097 0.0005522 debye
polarizability: 218.5473255|-3.4695362|139.2564729|-0.3112387|0.0052303|75.2325193 unknown
InChI: InChI=1S/C11H16N2O/c1-8-5-6-10(7-9(8)2)12-11(14)13(3)4/h5-7,12H,1-4H3
charge 0 multiplicity 1
30 atoms
O  -2.255124 -1.633058 0.004799
N  -1.176703 0.46484 0.002266
N  -3.533819 0.330164 0.007642
C  2.550183 0.817771 -0.005587
C  2.986722 -0.542449 -0.006506
C  0.19026 0.064323 -0.000586
C  1.166482 1.098178 -0.002643
C  2.003439 -1.560194 -0.004421
C  0.61917 -1.286436 -0.001499
C  3.556732 1.955293 -0.007874
C  4.464473 -0.891962 -0.009867
C  -2.312049 -0.362517 0.004881
C  -4.77788 -0.454727 0.01031
C  -3.635554 1.795746 0.007071
H  0.839716 2.14816 -0.001972
H  2.32832 -2.608075 -0.005077
H  -0.122813 -2.086029 0.000153
H  -1.322758 1.474637 0.002917
H  4.215017 1.912742 -0.897177
H  3.056031 2.938749 -0.006285
H  4.219661 1.91225 0.877936
H  4.982418 -0.484174 -0.900082
H  4.987149 -0.481732 0.876428
H  4.61147 -1.985473 -0.008779
H  -5.386429 -0.239042 -0.88928
H  -5.383074 -0.238225 0.911955
H  -4.505018 -1.520917 0.010276
H  -4.700059 2.078795 0.009369
H  -3.180715 2.250616 -0.897595
H  -3.176647 2.251548 0.909226
