program: Gaussian 09
title: 000185663
version: EM64L-G09RevD.01
frameworkgroup: C1[X(C8H14O2)]
method: RPBEPBE
basis: SDD
operation: Freq
keyword: #pfreq=noraman
keyword: PBEPBE/SDD
title: #p freq=noraman PBEPBE/SDD
converged: YES YES NO NO
title: Mulliken charges:
elementType: O O C C C C C C C C H H H H H H H H H H H H H H
charge: -0.220626 -0.220637 -0.141782 -0.141401 -0.755971 -0.756196 0.192061 0.191871 -0.783780 -0.783759 0.269975 0.269920 0.254209 0.225826 0.224041 0.225803 0.254354 0.223907 0.238603 0.242790 0.254682 0.238641 0.242808 0.254663
chargesum: 0.00000
title: Mulliken charges with hydrogens summed into heavy atoms:
elementType: O O C C C C C C C C
charge: -0.220626 -0.220637 0.128193 0.128518 -0.051896 -0.052132 0.192061 0.191871 -0.047706 -0.047647
polarizability: 1.05002237e+02 3.44211949e+00 9.17502746e+01 5.81252644e-03 -2.25415135e-03 7.32355002e+01
1716.lowfreq: -13.6879 -4.7563 0.0004 0.0007 0.0009 6.1754 44.4535 55.4564 68.9635
frequency: 44.4534 55.3653 68.9630 145.1992 151.7081 156.4714 193.6156 214.4304 249.7712 285.6606 289.0554 319.1314 337.1369 406.9993 495.2486 522.4863 538.2754 593.7698 633.3506 748.2650 755.9205 870.8844 945.3801 950.2555 959.8717 963.8858 988.6201 1001.3661 1072.1517 1079.8422 1117.6945 1165.8990 1191.1596 1201.6340 1258.8290 1263.7943 1313.6282 1322.5799 1369.7089 1369.7842 1387.7051 1390.9123 1442.7786 1443.0793 1452.9524 1454.4188 1475.1180 1484.5054 1492.3937 1492.7697 1610.3717 1614.3927 2940.3538 2943.7740 2983.6299 2983.7029 2990.7237 2993.6535 3068.5175 3068.6123 3083.3671 3088.6510 3093.5842 3094.6732 3120.3929 3120.4213
redmass: 4.4094 3.6800 3.5705 1.3398 1.0478 2.0641 2.8229 1.1902 1.9908 1.5888 1.9828 2.6588 3.4763 3.0714 2.6616 4.7462 3.1728 3.1596 2.3692 3.2613 2.6700 2.1761 1.3482 1.3367 1.6712 1.5479 2.1514 1.4582 1.6735 2.0466 2.4145 2.9813 2.0337 1.4191 2.7408 1.3944 1.3488 2.2225 1.2455 1.2471 1.1993 1.1854 1.0754 1.0766 1.0552 1.0551 1.0519 1.0469 1.0610 1.0443 8.4731 7.9244 1.0789 1.0802 1.0373 1.0373 1.0357 1.0355 1.0956 1.0956 1.0999 1.0993 1.1001 1.0996 1.1003 1.1003
irintensity: 8.7922 1.1661 2.9893 6.2359 0.3547 8.1090 0.1028 0.0109 0.0554 0.0078 1.8003 0.1536 1.0297 4.4233 10.9568 18.7960 1.0553 0.0672 3.7977 3.2233 0.3952 0.7940 41.2011 2.1377 1.2195 10.9053 3.4820 0.5509 65.6240 3.4056 19.7213 0.7114 2.3906 2.8648 162.5365 3.3254 5.0564 0.5307 100.9847 14.0947 20.4699 22.4943 59.7868 4.1463 6.8766 32.4027 13.2403 1.9791 0.6925 15.5881 192.7253 22.9714 36.8426 8.8255 4.7477 0.0699 13.6410 32.0054 9.5206 14.3485 47.8182 15.3014 0.4589 39.4052 7.8536 18.4067
temp: 298.150 k
press: 1.00000 atm
elementType: 8 8 6 6 6 6 6 6 6 6 1 1 1 1 1 1 1 1 1 1 1 1 1 1
symmnumber: 1
zpe: 531905.8 jmol-1
zpe.correction: 0.202592 hartree
zpe.thermalcorrener: 0.215057 hartree
zpe.thermalcorrenthalpy: 0.216001 hartree
zpe.thermalcorrgfe: 0.163941 hartree
zpe.sumelectzpe: -462.889402 hartree
zpe.sumelectthermal: -462.876937 hartree
zpe.sumelectthermalent: -462.875993 hartree
zpe.sumelectthermalfe: -462.928053 hartree
dipole: -0.0013 0.0007 1.8438
dipole: 1.8438
quadrupole: -56.9962 -69.4365 -61.6088
quadrupole: 11.9409 0.0007 -0.0044
quadrupole: 5.6843 -6.7560 1.0717 11.9409 0.0007 -0.0044
hfenergy: -463.0919944 hartree
pointgroup: C01 [X(C8H14O2)]
dipole: 0.0003742 0.7253287 -0.0095659 debye
dipolederiv: -0.6688331 -0.07393 -0.0228116 -0.0536343 -0.3530666 -0.1553604 -0.0026677 -0.2060513 -0.8224444 -0.6686302 0.0738847 -0.0245542 0.054266 -0.3444574 0.1431312 -0.0039488 0.1938612 -0.8315449 -0.2751467 -0.0726924 -0.1307603 0.030014 0.0592391 -0.0054722 -0.273171 -0.0768759 -0.1424735 -0.2758565 0.0696572 -0.1326451 -0.0371404 0.0617656 -0.0002826 -0.2714296 0.071986 -0.1442086 -0.0532243 -0.0071406 -0.0208838 0.0053303 0.0513523 -0.0585733 0.0444606 -0.0568241 0.0465351 -0.0532644 0.0069558 -0.0208886 -0.0035034 0.0542603 0.0587338 0.0446814 0.0565679 0.0430839 1.1444802 0.1613718 0.0012734 0.087604 0.1272318 0.1991187 -0.0062312 0.2694037 0.870893 1.1441997 -0.1626263 0.0053291 -0.0890765 0.1162623 -0.1795578 -0.0040465 -0.2500861 0.8823867 -0.451011 0.0323846 0.2112988 0.0853972 0.0137105 -0.0668116 0.2087298 -0.0436125 -0.1145875 -0.4508434 -0.0261568 0.2120887 -0.0793819 0.0166291 0.0630496 0.2112946 0.0400191 -0.1176449 0.1591231 -0.0236588 -0.0003205 -0.0539983 -0.0345921 0.0469091 0.0944747 0.0727135 0.03573 0.159319 0.0229149 -0.0012094 0.0558924 -0.038244 -0.0447293 0.0926512 -0.0708842 0.0391205 -0.0531236 -0.0645903 -0.11259 -0.0589155 0.0651234 -0.0131417 -0.0905356 -0.0240997 0.0578047 -0.0459562 0.0162683 0.1547728 -0.0004164 0.0698395 0.0269915 0.1512749 -0.0001078 -0.0189302 0.0897119 0.0360401 -0.0232666 0.0189492 -0.0814436 0.0580649 -0.0423038 0.1165339 -0.0003875 -0.0456949 -0.0115222 0.1551578 0.0050846 0.0689438 -0.029948 0.1513206 -0.0028676 -0.0183704 -0.0528191 0.0619382 -0.1141817 0.0569086 0.0659544 0.0131805 -0.091945 0.0240979 0.0570792 0.089386 -0.0375706 -0.0224588 -0.0209521 -0.0861856 -0.0555972 -0.0422508 -0.1139004 0.0043952 0.0822267 0.038494 -0.0476673 -0.0043012 0.0935048 0.082681 -0.0131244 0.0679358 -0.0695043 0.1057287 0.0069602 0.0264357 0.0400808 -0.0804398 -0.0142067 0.014314 -0.0058887 0.1074493 -0.0338195 -0.0657725 -0.0352357 -0.1019474 0.0712467 -0.0363378 -0.0853263 -0.0608469 0.0483059 0.0822909 -0.0398006 -0.0465122 0.0039053 0.0893456 -0.0869694 -0.0132487 -0.0723371 -0.0651425 0.1056643 -0.0062616 0.0267089 -0.0397056 -0.0797731 0.0193662 0.0152863 0.0110687 0.1068059 -0.0339075 0.0648531 -0.0370791 0.0995404 0.073793 0.0357615 -0.0882586 0.0601948 0.0456491 unknown
polarizability: 104.854233|-0.0812849|73.2387657|-3.7123659|0.2456144|91.8950129 unknown
InChI: InChI=1S/C8H14O2/c1-5(7(3)9)6(2)8(4)10/h5-6H,1-4H3
charge 0 multiplicity 1
24 atoms
O  -1.909256 -1.212326 -1.471181
O  1.913663 -1.179651 1.487197
C  -0.606029 -0.504294 0.479649
C  0.612144 -0.519823 -0.481582
C  -0.707337 0.785842 1.336302
C  0.717115 0.745234 -1.37447
C  -1.910251 -0.832593 -0.26618
C  1.915605 -0.830863 0.272864
C  -3.218004 -0.719742 0.509619
C  3.223716 -0.739546 -0.505143
H  -0.452323 -1.33734 1.203006
H  0.45574 -1.372537 -1.181044
H  0.242683 0.942227 1.875131
H  -1.505447 0.704805 2.09441
H  -0.913917 1.677686 0.718303
H  1.513995 0.640278 -2.130967
H  -0.232937 0.889835 -1.916551
H  0.927582 1.653477 -0.78222
H  -3.12389 -1.138773 1.527917
H  -3.500477 0.344694 0.622456
H  -4.019152 -1.238089 -0.039875
H  3.130032 -1.186576 -1.511549
H  3.506241 0.321318 -0.647394
H  4.024608 -1.242643 0.058702
