program: Gaussian 09
title: 000185622
version: EM64L-G09RevD.01
frameworkgroup: C1[X(C12H11Cl5O6)]
method: RPBEPBE
basis: SDD
operation: Freq
keyword: #p
keyword: freq=noraman
keyword: PBEPBE/SDD
title: #p freq=noraman PBEPBE/SDD
converged: YES YES NO NO
title: Mulliken charges:
elementType: Cl Cl Cl Cl Cl O O O O O O C C C C C C C C C C C C H H H H H H H H H H H
charge: 0.048597 0.055685 0.064103 0.065222 0.069191 -0.263697 -0.265519 -0.439406 -0.430272 -0.431091 -0.432942 -0.046663 -0.246000 -0.141770 -0.056100 -0.177470 -0.349738 0.733626 -0.341916 -0.303461 -0.074770 -0.076371 -0.125303 0.198268 0.314030 0.296270 0.215447 0.295828 0.213736 0.233826 0.358418 0.333485 0.353134 0.353623
chargesum: 0.00000
title: Mulliken charges with hydrogens summed into heavy atoms:
elementType: Cl Cl Cl Cl Cl O O O O O O C C C C C C C C C C C C
charge: 0.048597 0.055685 0.064103 0.065222 0.069191 -0.263697 -0.265519 -0.080987 -0.096787 -0.077957 -0.079319 0.151605 0.068030 0.154500 0.159347 0.118358 0.097824 0.733626 -0.341916 -0.303461 -0.074770 -0.076371 -0.125303
polarizability: 2.65833703e+02 3.70473357e+00 2.25727046e+02 9.14453520e+00 9.86888414e+00 1.21817198e+02
1716.lowfreq: -7.4073 -0.0011 0.0014 0.0018 1.6971 4.1112 15.9223 27.0366 37.7545
frequency: 15.2667 26.9796 37.7458 51.9762 64.0043 70.6143 77.4771 85.8209 96.8028 125.9323 128.4958 172.4844 180.7973 201.8270 205.6430 206.8690 217.2420 218.7976 241.7918 262.5960 289.8035 302.3896 315.6915 324.7325 325.9061 334.1444 341.0317 358.0881 361.1282 386.7480 399.7816 419.3798 433.5031 450.7470 465.4373 478.1003 512.1193 542.3511 586.4887 587.2658 611.2052 634.5133 663.2681 715.9256 745.8454 761.4280 797.4222 817.4711 826.6492 890.2643 923.9173 946.6161 955.9691 967.2065 997.2389 1008.5582 1013.1767 1063.5204 1071.3270 1080.1598 1111.8723 1117.6771 1160.9576 1183.5139 1202.4842 1222.2872 1233.5373 1255.0403 1277.3239 1294.3802 1307.3958 1312.9144 1328.4790 1333.8152 1338.7443 1343.7337 1350.9245 1356.5651 1363.1571 1373.3351 1377.2684 1381.8664 1461.2377 1517.2558 1541.1694 2906.5200 2948.0726 3004.6631 3086.5256 3091.6124 3102.1100 3116.5456 3518.5634 3528.0475 3541.4225 3553.4052
redmass: 10.3192 10.1583 9.3160 10.6976 6.5055 21.3132 15.6262 9.4202 5.7495 7.3718 5.4930 8.1340 4.6291 14.4153 28.2740 14.6032 28.8290 6.0955 5.9989 5.3702 4.4941 10.3475 8.0194 4.3651 3.2283 3.9790 1.1794 18.6599 5.0080 3.4271 4.1144 3.6611 1.2819 1.4224 4.4222 5.8366 4.2999 7.6459 7.2396 4.7696 12.9750 11.5551 11.9655 11.2275 3.6470 9.7795 4.7178 12.0754 8.4187 3.2234 9.9176 4.6919 3.6440 4.6094 2.3583 3.4382 5.5307 5.8443 3.7249 4.8152 2.0246 2.3002 1.1516 1.2970 1.3460 1.2571 10.1403 1.2094 1.6087 1.3096 1.4966 5.4298 1.3676 1.5368 4.4881 1.2674 1.2625 2.2814 1.8875 1.2981 1.3699 1.3518 1.0835 11.9824 11.6095 1.0827 1.0836 1.0647 1.0879 1.0864 1.0990 1.0871 1.0658 1.0661 1.0656 1.0657
irintensity: 0.0633 0.1744 2.0312 0.8980 4.4312 0.4238 0.0399 0.5723 2.1594 5.0459 8.4051 0.4567 0.9660 4.0058 1.1483 3.0156 0.1981 7.6752 10.4843 20.2578 6.4726 5.6132 8.6393 14.0027 44.7297 29.8010 49.3150 0.4295 12.4514 22.4595 25.5956 15.3052 169.6187 168.3940 22.4468 5.8051 1.2657 4.5301 7.2116 14.4659 9.1813 18.9915 52.1401 29.3686 55.6102 23.6577 4.5920 28.9548 405.2905 7.0430 122.8213 133.0351 116.5687 90.5660 2.3982 79.5872 48.2272 47.8404 62.7727 4.1903 15.3119 30.6797 26.5241 12.7849 90.6818 27.6769 2.5743 39.6970 97.3995 5.8752 30.9015 93.7863 65.7931 16.8528 72.6504 22.8980 12.3630 145.3695 59.6653 23.0607 27.6238 17.1217 7.2842 3.7992 8.2084 48.0657 49.8186 29.8627 5.5088 1.5859 17.6346 2.8573 7.4858 8.5330 13.9741 8.2033
temp: 298.150 k
press: 1.00000 atm
elementType: 17 17 17 17 17 8 8 8 8 8 8 6 6 6 6 6 6 6 6 6 6 6 6 1 1 1 1 1 1 1 1 1 1 1
symmnumber: 1
zpe: 577438.1 jmol-1
zpe.correction: 0.219935 hartree
zpe.thermalcorrener: 0.244234 hartree
zpe.thermalcorrenthalpy: 0.245178 hartree
zpe.thermalcorrgfe: 0.163744 hartree
zpe.sumelectzpe: -3213.689359 hartree
zpe.sumelectthermal: -3213.665059 hartree
zpe.sumelectthermalent: -3213.664115 hartree
zpe.sumelectthermalfe: -3213.745549 hartree
dipole: -1.6701 0.0462 0.5357
dipole: 1.7545
quadrupole: -154.9159 -183.7990 -172.9946
quadrupole: -0.5611 2.3172 6.5787
quadrupole: 15.6540 -13.2292 -2.4248 -0.5611 2.3172 6.5787
hfenergy: -3213.9092931 hartree
pointgroup: C01 [X(C12H11Cl5O6)]
dipole: 0.6055346 0.0547837 0.3267979 debye
polarizability: 263.5188235|9.7100059|222.0043236|17.4509568|-22.0974145|127.8548003 unknown
InChI: InChI=1S/C12H11Cl5O6/c13-3-4(14)6(16)11(7(17)5(3)15)23-12-10(21)9(20)8(19)2(1-18)22-12/h2,8-10,12,18-21H,1H2
charge 0 multiplicity 1
34 atoms
Cl -0.387274 2.295687 -1.328278
Cl -1.150449 -3.023787 0.035141
Cl -4.333426 -2.624544 -0.152151
Cl -3.569571 2.691239 -1.604592
Cl -5.548837 0.234666 -0.979869
O  1.44119 0.38571 1.569003
O  0.432711 -0.445071 -0.487985
O  3.520696 -1.463081 -1.565628
O  4.400989 1.299276 -0.679821
O  2.735004 -2.278566 1.785892
O  2.049241 2.959168 2.610044
C  3.413548 -0.923762 -0.214098
C  3.180605 0.601174 -0.23607
C  2.277371 -1.69194 0.518137
C  2.71366 1.09173 1.147719
C  1.066276 -0.794603 0.82653
C  2.41069 2.590043 1.240185
C  -0.953654 -0.303886 -0.543327
C  -1.504873 0.937676 -0.953345
C  -1.838798 -1.394123 -0.325576
C  -3.236269 -1.23295 -0.450037
C  -2.900232 1.104163 -1.094172
C  -3.771918 0.0215 -0.826767
H  4.35032 -1.121561 0.360636
H  2.433733 0.850886 -1.006446
H  1.971005 -2.541948 -0.107389
H  3.470012 0.836708 1.923574
H  0.333194 -1.310085 1.467411
H  1.609134 2.849948 0.521521
H  3.315709 3.170278 1.000337
H  4.125027 -0.873561 -2.087758
H  5.141353 1.10019 -0.047387
H  2.783353 -1.566215 2.476413
H  1.24358 2.437243 2.859652
