program: Gaussian 09
title: 000185608
version: EM64L-G09RevD.01
frameworkgroup: C1[X(C18H16O)]
method: RPBEPBE
basis: SDD
operation: Freq
keyword: #pfreq=noraman
keyword: PBEPBE/SDD
title: #p freq=noraman PBEPBE/SDD
converged: YES YES NO NO
title: Mulliken charges:
elementType: O C C C C C C C C C C C C C C C C C C H H H H H H H H H H H H H H H H
charge: -0.212696 0.125756 0.132517 -0.539600 0.186779 0.218784 -0.565201 -0.530738 -0.526128 -0.020647 0.208679 -0.430000 0.446881 -0.504908 -0.597672 -0.447662 0.452450 -0.372565 -0.816658 0.228936 0.254446 0.235913 0.223713 0.236847 0.241700 0.248952 0.246122 0.239039 0.240080 0.232069 0.241766 0.233768 0.231316 0.226938 0.231022
chargesum: 0.00000
title: Mulliken charges with hydrogens summed into heavy atoms:
elementType: O C C C C C C C C C C C C C C C C C C
charge: -0.212696 0.125756 0.132517 -0.056218 0.186779 0.218784 -0.105575 -0.052191 -0.031054 -0.020647 0.208679 -0.190962 0.446881 -0.264827 -0.365603 -0.205897 0.452450 -0.138796 -0.127382
polarizability: 3.55286769e+02 -5.79075491e+00 2.07083048e+02 -2.30079649e-01 -6.27168621e-01 9.65864305e+01
1716.lowfreq: -4.8194 -0.0007 -0.0007 -0.0004 3.5577 10.3340 42.9524 65.0687 86.7448
frequency: 42.9158 65.0625 86.7448 102.4311 112.9415 129.8395 148.0393 183.7302 224.0256 244.8149 277.4276 284.9857 324.3085 348.0991 408.0709 426.0002 441.3109 468.1346 479.1014 522.6502 535.8821 564.9213 578.9735 586.8609 609.8918 633.3969 676.0520 693.1619 708.1831 718.6039 798.7642 803.0145 827.7152 832.2298 845.6523 858.2378 892.5631 895.3901 943.4950 964.0830 973.7437 981.8606 990.9674 1000.7127 1004.8147 1021.3231 1028.1611 1049.3372 1077.9578 1132.0713 1143.3930 1165.0958 1166.8856 1186.7864 1195.1307 1209.0240 1223.5115 1236.8153 1238.7059 1261.4717 1269.9121 1291.6872 1309.3239 1327.9223 1352.4819 1385.1929 1398.8075 1403.6206 1414.1162 1431.0590 1435.0489 1452.0001 1458.1543 1460.3430 1463.4472 1468.4990 1477.9812 1521.7511 1554.7536 1595.7140 1610.5380 1629.3347 1643.3899 2952.4988 2968.6250 2975.1368 2983.3825 3017.1818 3029.3684 3050.1117 3051.6705 3057.1692 3074.3938 3086.6236 3116.6002 3125.1318 3140.1263 3145.3671 3151.1408
redmass: 4.3131 4.3971 1.0760 2.3383 3.5298 2.5680 3.8979 2.5749 3.2132 3.5460 6.2324 3.5495 3.3375 3.6689 3.0063 4.0902 4.3030 3.9140 3.6545 4.5635 3.0001 3.6324 3.8590 3.2854 4.4959 4.5088 2.8514 5.4438 3.6289 3.6769 2.2689 1.5599 3.1116 1.7437 3.7286 1.5114 1.8497 2.6566 2.9823 1.3301 2.9692 1.4296 2.0020 2.0465 2.3157 2.5100 2.2948 1.5613 2.8619 1.2189 2.0763 1.2851 1.2522 1.6277 1.1317 2.6152 1.4405 1.5778 1.8111 1.7528 1.8336 1.8088 1.6600 2.3243 2.6821 2.9256 1.2525 3.4026 4.8366 2.9321 1.1050 1.3042 1.3664 1.1207 1.4902 1.0459 1.2709 3.4438 7.0208 8.7311 7.9428 6.7337 8.1763 1.0702 1.0658 1.0375 1.0602 1.0621 1.1007 1.0922 1.0974 1.0917 1.1018 1.0985 1.0865 1.0868 1.0959 1.0920 1.0970
irintensity: 0.0587 3.2407 0.6065 2.2354 1.4265 0.3405 2.3442 2.8454 4.4425 2.5117 0.7043 0.3739 2.2043 9.7179 1.0894 2.7648 1.9938 5.1462 7.5701 1.8966 3.6253 2.5311 4.0124 1.7772 4.6571 2.4364 0.3737 5.0186 5.9943 1.6648 2.3619 1.1247 4.0100 16.7596 4.5746 66.6851 0.6773 1.5067 1.2176 0.2226 27.1697 3.8107 0.7248 6.7739 11.9597 1.6122 3.7255 11.2076 21.4922 0.7005 4.9265 1.6445 5.1151 35.8818 1.3525 5.0907 14.6564 1.9028 1.5164 18.8969 32.0482 72.1113 7.2039 14.3651 34.0829 71.2395 10.5341 1.0407 27.3572 20.9709 6.9281 13.1145 16.5831 11.5024 7.2570 13.2199 34.0073 9.5780 64.2027 319.6113 165.7288 15.7144 8.9480 15.9065 27.1069 43.3023 23.0678 18.4231 9.5652 15.3241 19.6032 20.2786 13.4206 16.4339 4.7386 3.7959 35.8184 15.0583 22.6828
temp: 298.150 k
press: 1.00000 atm
elementType: 8 6 6 6 6 6 6 6 6 6 6 6 6 6 6 6 6 6 6 1 1 1 1 1 1 1 1 1 1 1 1 1 1 1 1
symmnumber: 1
zpe: 746799.2 jmol-1
zpe.correction: 0.284441 hartree
zpe.thermalcorrener: 0.300004 hartree
zpe.thermalcorrenthalpy: 0.300949 hartree
zpe.thermalcorrgfe: 0.241593 hartree
zpe.sumelectzpe: -769.449934 hartree
zpe.sumelectthermal: -769.434370 hartree
zpe.sumelectthermalent: -769.433426 hartree
zpe.sumelectthermalfe: -769.492782 hartree
dipole: -4.4485 2.4223 0.4500
dipole: 5.0852
quadrupole: -118.5714 -103.2660 -113.6922
quadrupole: 17.7584 2.1019 -1.1539
quadrupole: -6.7282 8.5772 -1.8490 17.7584 2.1019 -1.1539
hfenergy: -769.7343745 hartree
pointgroup: C01 [X(C18H16O1)]
dipole: 1.7666217 0.9185974 -0.194686 debye
polarizability: 355.4433523|3.0574735|206.9202143|-1.2924868|-0.6474674|96.5926801 unknown
InChI: InChI=1S/C18H16O/c1-11-2-3-12-4-5-13-14-8-9-18(19)16(14)7-6-15(13)17(12)10-11/h2-5,10H,6-9H2,1H3
charge 0 multiplicity 1
35 atoms
O  -4.929723 -1.637761 0.193693
C  -2.130049 0.550413 -0.050157
C  -2.663064 -0.705502 0.136034
C  -1.799213 -1.902406 0.429177
C  0.193624 -0.329734 -0.046856
C  -0.683895 0.78756 -0.004235
C  -0.401701 -1.729849 -0.218978
C  -3.210299 1.604535 -0.26625
C  -4.540735 0.801236 -0.231684
C  -4.134488 -0.662611 0.057656
C  1.618337 -0.109982 -0.022948
C  -0.160648 2.122904 0.068248
C  2.12725 1.248011 0.065411
C  1.210663 2.348023 0.109372
C  2.575737 -1.182501 -0.093824
C  3.543533 1.462621 0.094679
C  3.956879 -0.957628 -0.069243
C  4.435043 0.393913 0.030649
C  4.950268 -2.102729 -0.143144
H  -1.697337 -2.012944 1.529088
H  -2.284247 -2.827551 0.069682
H  -0.482794 -1.931675 -1.308994
H  0.275304 -2.499898 0.188071
H  -3.176362 2.375966 0.527516
H  -3.064454 2.136423 -1.225667
H  -5.087515 0.846355 -1.190875
H  -5.23745 1.153035 0.55007
H  -0.858286 2.966852 0.097667
H  1.608562 3.367665 0.170348
H  2.219893 -2.214813 -0.172229
H  3.917176 2.491085 0.166479
H  5.516425 0.576009 0.054404
H  5.599581 -2.127496 0.752614
H  4.441861 -3.078945 -0.218143
H  5.615921 -1.999681 -1.021134
