program: Gaussian 09
title: 000185606
version: EM64L-G09RevD.01
frameworkgroup: C1[X(C11H20O2)]
method: RPBEPBE
basis: SDD
operation: Freq
keyword: #pfreq=noraman
keyword: PBEPBE/SDD
title: #p freq=noraman PBEPBE/SDD
converged: NO YES NO NO
title: Mulliken charges:
elementType: O O C C C C C C C C C C C H H H H H H H H H H H H H H H H H H H H
charge: -0.427603 -0.236300 0.306782 0.300628 -0.489015 -0.490941 -0.424731 -0.431729 -0.384340 0.074781 -0.764069 -0.766712 -0.748469 0.246187 0.195408 0.214890 0.222913 0.213344 0.194527 0.193265 0.230596 0.183987 0.202157 0.224086 0.205588 0.253309 0.230058 0.216492 0.216333 0.228683 0.210369 0.226907 0.372620
chargesum: 0.00000
title: Mulliken charges with hydrogens summed into heavy atoms:
elementType: O O C C C C C C C C C C C
charge: -0.054984 -0.236300 0.306782 0.300628 -0.047420 -0.053138 -0.016861 -0.007868 0.001804 0.074781 -0.081086 -0.103830 -0.082510
polarizability: 1.27712818e+02 -1.29814011e+00 1.16891736e+02 1.26938213e+00 1.46415561e-01 1.15564337e+02
1716.lowfreq: -15.6293 -11.1315 -0.0007 -0.0002 0.0007 16.7659 55.0942 86.4089 114.7375
frequency: 54.9768 86.3582 114.7050 170.9269 175.1057 206.9094 223.5132 253.3635 271.7399 287.4192 294.1142 312.4009 318.3665 332.5518 376.3794 398.1868 409.4214 431.4024 458.7246 514.3791 519.9707 539.3446 598.1799 653.9407 705.7616 785.0180 789.4928 814.9120 842.1533 904.5967 910.0116 916.6172 926.6056 926.7941 930.8084 948.2499 1017.1364 1018.5347 1022.3538 1036.8198 1066.4278 1083.3377 1103.1586 1141.3089 1155.6626 1189.9746 1206.0444 1224.3443 1238.3637 1246.4487 1263.3617 1279.2421 1301.6461 1319.0768 1336.0556 1338.5000 1342.7669 1358.4163 1382.3608 1385.8530 1408.6566 1449.3465 1454.8311 1465.1992 1466.0261 1470.9277 1471.3175 1473.5328 1482.1255 1485.4894 1491.5355 1497.5508 1634.9238 2961.9645 2974.1096 2977.7673 2978.4782 2983.0461 2985.8504 2987.9383 3001.8058 3027.0220 3033.1023 3044.9841 3063.6465 3063.9219 3069.2146 3072.7673 3079.7746 3082.0455 3085.6670 3093.8486 3496.5066
redmass: 4.2014 4.5144 3.0263 2.8948 3.8372 2.3428 1.0870 1.2248 1.3138 1.9658 2.4898 2.8718 2.2285 2.3320 1.8353 2.6541 2.7680 2.8909 2.3983 3.4753 1.6888 3.2224 1.5608 2.6086 3.7209 1.4752 2.5587 2.4301 2.3770 1.9701 2.3400 2.7532 1.6179 1.5458 1.5988 1.2224 2.2958 1.9152 1.4755 1.9739 1.9326 1.3969 1.6800 1.6679 2.2644 1.9465 2.2340 2.7714 2.8364 1.4431 1.3926 1.2380 1.9868 1.3315 1.3708 1.3814 1.4906 1.4240 1.1927 1.1937 1.1996 1.0834 1.0742 1.0719 1.0573 1.0784 1.0626 1.0623 1.0850 1.0576 1.0544 1.0542 8.1215 1.0631 1.0621 1.0356 1.0360 1.0386 1.0614 1.0635 1.0617 1.0950 1.1006 1.1006 1.1003 1.1007 1.1000 1.0983 1.0960 1.0997 1.0987 1.0990 1.0637
irintensity: 0.6065 0.4252 0.0861 0.2115 0.3215 0.1115 0.0362 0.1744 0.1271 1.8768 1.0769 0.0429 0.4340 0.8379 1.8522 1.9352 0.3105 0.1153 2.9929 13.0531 3.6404 8.2889 75.4372 42.6967 31.0596 0.2166 3.2220 2.3787 8.0262 9.5919 22.4189 2.6434 5.7927 1.3513 1.4114 0.2546 142.9087 4.3424 1.0787 75.3109 10.8318 4.8517 0.9922 3.8956 4.6679 1.3089 45.7236 4.8507 5.1979 0.5117 3.6143 3.0722 12.0147 0.0508 3.7769 3.1469 0.3735 2.9287 22.3624 28.2287 19.9921 6.2623 2.5121 5.5278 2.2703 10.3646 1.7990 11.3944 10.5828 5.4632 5.1071 21.1962 179.1243 36.7015 34.1276 23.3836 23.9054 16.7354 29.7978 38.3985 29.5320 64.8178 50.9675 55.0875 6.4933 5.1916 48.8037 73.9695 27.7021 16.0257 50.0296 21.4721 20.5249
temp: 298.150 k
press: 1.00000 atm
elementType: 8 8 6 6 6 6 6 6 6 6 6 6 6 1 1 1 1 1 1 1 1 1 1 1 1 1 1 1 1 1 1 1 1
symmnumber: 1
zpe: 764267.3 jmol-1
zpe.correction: 0.291094 hartree
zpe.thermalcorrener: 0.305148 hartree
zpe.thermalcorrenthalpy: 0.306092 hartree
zpe.thermalcorrgfe: 0.252186 hartree
zpe.sumelectzpe: -580.572357 hartree
zpe.sumelectthermal: -580.558303 hartree
zpe.sumelectthermalent: -580.557359 hartree
zpe.sumelectthermalfe: -580.611265 hartree
dipole: 0.3242 -0.8339 1.2851
dipole: 1.5659
quadrupole: -79.7301 -77.6708 -85.8198
quadrupole: 0.3789 -0.7677 4.5526
quadrupole: 1.3434 3.4028 -4.7462 0.3789 -0.7677 4.5526
hfenergy: -580.8634511 hartree
pointgroup: C01 [X(C11H20O2)]
dipole: -0.0825592 -0.319412 -0.5202917 debye
polarizability: 127.3861909|1.6773336|117.0118233|2.0565023|0.0450225|115.7708776 unknown
InChI: InChI=1S/C11H20O2/c1-10(2,3)11(9(12)13)7-5-4-6-8-11/h12H,4-8H2,1-3H3
charge 0 multiplicity 1
33 atoms
O  -0.200744 2.159753 -0.917123
O  -0.026599 1.970626 1.371651
C  -0.051779 -0.122221 0.009179
C  -1.587034 -0.623388 -0.120862
C  0.767622 -0.441379 -1.282145
C  0.659044 -0.784108 1.234188
C  2.265289 -0.068658 -1.158009
C  2.15348 -0.399716 1.35795
C  2.929233 -0.739398 0.065371
C  -0.078557 1.393919 0.260788
C  -2.205723 -0.209886 -1.486685
C  -1.664702 -2.173314 -0.011693
C  -2.464472 -0.018278 1.012334
H  0.333144 0.086245 -2.146686
H  0.685714 -1.528839 -1.480106
H  0.597011 -1.881468 1.112674
H  0.13228 -0.519661 2.168264
H  2.362542 1.032801 -1.073425
H  2.789785 -0.358898 -2.089218
H  2.593362 -0.936381 2.220983
H  2.245003 0.681055 1.57948
H  2.938572 -1.840103 -0.080114
H  3.985103 -0.418039 0.153866
H  -1.756876 -0.768797 -2.327069
H  -3.288586 -0.436355 -1.478591
H  -2.079526 0.867899 -1.685046
H  -1.459002 -2.530651 1.0122
H  -0.966747 -2.677774 -0.704293
H  -2.688022 -2.500266 -0.275401
H  -2.603522 1.071189 0.891201
H  -3.466086 -0.486744 0.990945
H  -2.030699 -0.191403 2.012679
H  -0.228713 3.121638 -0.657386
