program: Gaussian 09
title: 000185604
version: EM64L-G09RevD.01
frameworkgroup: C1[X(C16H34)]
method: RPBEPBE
basis: SDD
operation: Freq
keyword: #p
keyword: freq=noraman
keyword: PBEPBE/SDD
title: #p freq=noraman PBEPBE/SDD
converged: YES YES NO NO
title: Mulliken charges:
elementType: C C C C C C C C C C C C C C C C H H H H H H H H H H H H H H H H H H H H H H H H H H H H H H H H H H
charge: 0.371843 0.358624 0.274175 -0.432813 -0.833132 -0.824952 -0.818456 -0.809300 -0.755620 -0.764884 -0.746853 -0.436150 -0.367578 -0.355984 -0.356740 -0.697367 0.192854 0.184825 0.211693 0.220711 0.233628 0.234407 0.209840 0.222576 0.207030 0.248315 0.233599 0.230170 0.208915 0.221948 0.230654 0.206360 0.211182 0.250123 0.229870 0.198130 0.210791 0.212036 0.203628 0.211865 0.197514 0.186154 0.187833 0.187184 0.187285 0.194869 0.194774 0.209758 0.209700 0.214968
chargesum: 0.00000
title: Mulliken charges with hydrogens summed into heavy atoms:
elementType: C C C C C C C C C C C C C C C C
charge: 0.371843 0.358624 0.274175 -0.055134 -0.167100 -0.158129 -0.129511 -0.148267 -0.107425 -0.086760 -0.120399 -0.026771 0.006409 0.018485 0.032903 -0.062942
polarizability: 2.04263955e+02 3.15435802e+00 1.66385663e+02 5.31159115e-01 -4.13091006e-02 1.52985624e+02
1716.lowfreq: -0.0007 -0.0004 0.0005 2.8419 9.9259 14.3204 36.7071 51.6280 55.4979
frequency: 36.1978 51.5622 55.0521 76.9461 106.8156 121.2811 127.9296 142.2674 162.3227 188.7451 204.7873 223.8914 227.7426 238.4855 259.5564 278.9342 288.8187 298.3316 303.2853 308.2768 322.6447 336.4164 346.2157 366.5925 376.2167 388.1246 401.2408 411.4370 417.9847 423.2474 432.2869 454.1217 494.1115 523.5315 536.8657 625.2279 717.0112 724.5346 742.1156 790.4081 812.8321 846.1579 873.7616 889.9460 895.9104 913.2803 922.9301 927.2475 934.7007 938.8832 952.2201 963.6052 993.5089 1006.1882 1012.6587 1019.0232 1022.5992 1033.6717 1050.7532 1065.2063 1079.3214 1107.1646 1129.5570 1135.5336 1150.9880 1170.6493 1187.9753 1202.0200 1209.5070 1216.2586 1227.9881 1229.6908 1237.4618 1259.3748 1282.8048 1285.1670 1293.4014 1306.8304 1327.4923 1346.3570 1355.1865 1372.5146 1378.4649 1380.5805 1383.7482 1388.3176 1392.9168 1401.1265 1416.1258 1452.4409 1458.4295 1462.1178 1464.1877 1467.0919 1468.3970 1471.1101 1471.9736 1475.5374 1475.9737 1477.7882 1480.8528 1484.9728 1488.8840 1489.2989 1495.5721 1500.7377 1503.1721 1505.1636 1507.2869 1512.9145 2948.7965 2954.5776 2966.3882 2967.7731 2971.7040 2971.7709 2975.8813 2977.5331 2983.3661 2985.5304 2986.2298 2986.6189 2992.1894 2996.3302 3002.1011 3018.3048 3030.8775 3049.4803 3054.1358 3061.2360 3068.0722 3068.4338 3069.2279 3070.3078 3071.8288 3074.9507 3079.0698 3080.8931 3082.4385 3083.1773 3087.8780 3088.8620 3110.0028 3117.8312
redmass: 2.8933 3.2402 1.5953 2.3063 1.8994 2.1124 2.1722 2.4701 1.8687 1.3549 2.8773 1.1444 1.5355 2.4041 1.1934 1.6591 1.7142 2.1427 1.6164 1.2044 1.1959 2.1685 1.3339 2.2219 2.1496 2.1263 2.1468 2.3975 2.5160 2.3829 2.5474 2.5959 2.7985 2.3901 2.6314 2.6909 2.6628 1.0755 1.1123 1.2136 2.5773 2.1623 1.2926 1.8572 2.3307 1.7581 1.5582 1.5117 1.6109 1.2255 2.0319 1.2523 1.2800 1.3599 1.9740 1.7577 1.4445 2.1560 1.3989 2.7203 2.2383 1.9854 2.0044 2.7461 2.0800 2.2267 2.0621 2.5726 2.1564 2.5113 2.3892 2.0380 2.0088 1.3722 1.3120 1.0491 1.1481 1.1894 1.3797 1.5034 1.6497 1.2044 1.1955 1.1905 1.1961 1.2173 1.1975 1.1878 1.1812 1.0617 1.0570 1.0671 1.0640 1.0613 1.0522 1.0579 1.0518 1.0614 1.0460 1.0511 1.0639 1.0670 1.0869 1.0524 1.0564 1.0543 1.0506 1.0516 1.0537 1.0536 1.0588 1.0589 1.0582 1.0586 1.0369 1.0366 1.0585 1.0366 1.0368 1.0402 1.0907 1.0400 1.0370 1.0382 1.0997 1.1005 1.1038 1.1038 1.0984 1.0975 1.0982 1.0999 1.0972 1.0993 1.0997 1.0977 1.0980 1.0980 1.0981 1.0984 1.0976 1.0980 1.0971 1.0954
irintensity: 0.0004 0.0095 0.0011 0.0240 0.0005 0.0099 0.0029 0.0274 0.0278 0.1665 0.0090 0.0138 0.1327 0.0135 0.0343 0.0322 0.1371 0.0950 0.0101 0.0817 0.0048 0.0684 0.2772 0.2573 0.0758 0.1189 0.7675 0.2301 0.5145 0.1564 0.5884 0.0991 0.0700 0.2997 1.0809 2.1571 2.6510 11.0923 0.0378 2.6769 1.8891 2.8962 0.1874 3.9895 0.3770 1.5966 0.8554 0.5784 2.5387 0.1008 1.0807 0.2264 0.2345 0.1750 2.9067 2.0403 0.4606 5.9373 1.5762 0.6201 0.1388 7.3941 54.0065 11.9690 19.6916 1.3999 1.6821 2.0296 0.1898 7.0743 5.6974 14.7257 2.4174 1.1218 2.3780 0.1962 0.0724 5.7386 2.3710 2.1009 1.5546 3.1649 5.5426 16.2714 17.9231 10.7453 39.0437 60.8309 11.7067 2.0098 0.5101 0.6311 1.1586 1.7254 0.7579 3.4406 13.2864 8.2314 8.4867 3.7229 2.8628 5.0318 12.2510 2.6808 3.3579 2.0618 12.8227 7.6609 28.4982 3.5735 1.9227 12.3730 25.6032 27.2227 21.4778 47.5899 102.8605 25.5955 23.4425 59.6242 3.1682 18.4068 53.4427 21.5168 0.3768 2.1957 23.7340 87.3343 26.4103 17.3937 46.7071 62.6165 86.1949 64.7062 1.4667 87.5500 29.4888 73.6118 17.1915 36.8502 33.7098 57.6121 22.6268 31.0940
temp: 298.150 k
press: 1.00000 atm
elementType: 6 6 6 6 6 6 6 6 6 6 6 6 6 6 6 6 1 1 1 1 1 1 1 1 1 1 1 1 1 1 1 1 1 1 1 1 1 1 1 1 1 1 1 1 1 1 1 1 1 1
symmnumber: 1
zpe: 1217851.5 jmol-1
zpe.correction: 0.463855 hartree
zpe.thermalcorrener: 0.485088 hartree
zpe.thermalcorrenthalpy: 0.486032 hartree
zpe.thermalcorrgfe: 0.416161 hartree
zpe.sumelectzpe: -628.707356 hartree
zpe.sumelectthermal: -628.686124 hartree
zpe.sumelectthermalent: -628.685180 hartree
zpe.sumelectthermalfe: -628.755051 hartree
dipole: -0.0107 -0.0548 -0.0360
dipole: 0.0664
quadrupole: -108.4350 -107.6044 -106.9733
quadrupole: 0.0206 -0.1206 -0.3695
quadrupole: -0.7641 0.0665 0.6976 0.0206 -0.1206 -0.3695
hfenergy: -629.1712115 hartree
pointgroup: C01 [X(C16H34)]
dipole: 0.0039507 -0.0213836 0.0144823 debye
polarizability: 204.2330641|-2.6866972|166.314745|2.3484505|-0.1624709|153.087433 unknown
InChI: InChI=1S/C16H34/c1-9-10-11-12-13-15(5,6)16(7,8)14(2,3)4/h9-13H2,1-8H3
charge 0 multiplicity 1
50 atoms
C  2.285394 0.421104 0.377848
C  0.876771 1.053518 -0.154686
C  2.618539 -1.121243 -0.018338
C  -0.337438 0.091431 0.088757
C  3.44942 1.317118 -0.155163
C  2.318045 0.531954 1.93563
C  0.929426 1.43603 -1.666646
C  0.58183 2.383281 0.614629
C  4.13701 -1.420687 0.221999
C  1.851404 -2.171656 0.846627
C  2.363841 -1.466053 -1.515944
C  -1.756926 0.66419 -0.155759
C  -2.847147 -0.421622 0.005469
C  -4.282551 0.112745 -0.199728
C  -5.36898 -0.975236 -0.038767
C  -6.800824 -0.434367 -0.242844
H  -0.305467 -0.271613 1.135999
H  -0.227772 -0.800058 -0.557879
H  3.207363 2.390145 -0.058302
H  3.678857 1.122625 -1.217691
H  4.37248 1.144988 0.424974
H  2.413746 1.584716 2.251947
H  3.185085 -0.009252 2.354087
H  1.408932 0.12034 2.408512
H  -0.024079 1.907789 -1.966846
H  1.090301 0.568815 -2.324637
H  1.726581 2.171896 -1.870703
H  0.28838 2.201148 1.663466
H  1.448986 3.067664 0.616724
H  -0.251117 2.919155 0.12543
H  4.786501 -0.890705 -0.495755
H  4.312105 -2.504864 0.0875
H  4.468784 -1.159627 1.243339
H  0.758648 -2.107938 0.740012
H  2.097253 -2.077101 1.918961
H  2.156629 -3.187868 0.529661
H  2.875974 -0.761846 -2.196447
H  1.291048 -1.479471 -1.772527
H  2.764142 -2.476805 -1.726521
H  -1.968717 1.487294 0.554491
H  -1.833904 1.096922 -1.17342
H  -2.766709 -0.873874 1.016763
H  -2.656333 -1.243378 -0.716819
H  -4.365679 0.565546 -1.210143
H  -4.476568 0.932282 0.523855
H  -5.283238 -1.427799 0.970375
H  -5.174867 -1.79305 -0.762763
H  -7.032738 0.359933 0.491784
H  -6.919309 0.000252 -1.253557
H  -7.557115 -1.232667 -0.127452
