program: Gaussian 09
title: 000185602
version: EM64L-G09RevD.01
frameworkgroup: C1[X(C11H16N4O3)]
method: RPBEPBE
basis: SDD
operation: Freq
keyword: #p
keyword: freq=noraman
keyword: PBEPBE/SDD
title: #p freq=noraman PBEPBE/SDD
converged: YES YES NO NO
title: Mulliken charges:
elementType: O O O N N N N C C C C C C C C C C C H H H H H H H H H H H H H H H H
charge: -0.342090 -0.238625 -0.244658 -0.067144 -0.056262 -0.136866 -0.121598 0.135484 0.139910 0.154058 0.042948 -0.793045 -0.767234 0.278089 -0.615864 -0.600083 -0.605739 -0.078725 0.229212 0.260074 0.234210 0.257280 0.236876 0.227808 0.243537 0.248594 0.261282 0.227414 0.232969 0.278689 0.228363 0.228941 0.275694 0.246500
chargesum: 0.00000
title: Mulliken charges with hydrogens summed into heavy atoms:
elementType: O O O N N N N C C C C C C C C C C C
charge: -0.342090 -0.238625 -0.244658 -0.067144 -0.056262 -0.136866 -0.121598 0.135484 0.139910 0.154058 0.042948 -0.069549 -0.045269 0.278089 0.137548 0.138989 0.127259 0.167775
polarizability: 2.00476307e+02 -7.95648044e-01 2.05061542e+02 -7.13674904e+00 -3.78274580e-01 1.02044727e+02
1716.lowfreq: -3.8167 -0.0002 0.0009 0.0010 2.3091 6.7525 23.9736 30.5664 54.6532
frequency: 23.9168 30.5519 54.6488 60.3621 75.7349 81.7548 104.2469 116.9233 126.9018 138.3222 145.2823 157.8779 166.9051 206.4425 229.6864 242.5010 250.5234 281.2133 302.5680 312.1250 324.8471 366.5376 371.0062 387.5099 392.1316 437.2636 535.1462 537.2689 586.3114 601.0396 611.9866 667.7782 686.5453 725.6048 762.8316 776.4693 792.0257 875.3171 908.1524 966.1917 971.9730 995.1690 1025.1191 1037.2229 1055.6850 1056.8308 1075.6571 1097.9240 1105.7567 1128.9699 1137.5337 1149.6684 1202.1297 1242.8251 1261.2551 1289.4858 1332.8529 1361.6226 1367.7938 1385.8075 1396.4199 1401.6586 1407.2824 1423.6548 1436.0587 1447.2900 1455.5620 1462.3158 1466.3265 1471.3243 1475.5338 1475.6562 1479.6264 1485.0511 1486.9532 1499.4994 1521.3929 1560.4208 1616.9533 1705.8693 2972.1312 2977.6613 2978.3585 2983.4951 3010.8872 3044.7208 3051.2444 3053.8911 3054.0513 3059.7213 3105.3405 3112.6517 3123.9768 3127.9390 3128.5079 3149.2189
redmass: 4.3243 4.5167 3.4518 4.5426 1.2014 2.3755 1.4218 2.3982 1.2679 2.6618 1.1131 1.0301 4.4319 4.5621 3.6843 6.6621 2.6351 2.7636 3.5036 3.2840 3.9799 3.4364 3.6735 5.3695 5.3757 3.6386 5.4054 6.4233 4.9890 5.9797 5.4884 8.4059 6.8066 6.3991 8.3418 5.8349 8.1131 6.1881 3.2731 3.2019 1.9620 1.5806 1.4197 1.9995 1.5913 1.4541 2.5460 1.2235 2.0180 1.3114 3.0043 1.3743 5.0677 6.2265 5.0236 7.4376 4.7929 1.3796 3.6137 1.9476 2.3179 1.4062 1.3941 1.1587 1.2033 1.2375 1.5583 1.2117 1.0941 1.0473 1.0446 1.0445 1.0604 1.1984 1.0472 1.1753 4.0857 7.0435 6.5589 9.5322 1.0377 1.0397 1.0371 1.0392 1.0324 1.1015 1.0961 1.0912 1.1018 1.0961 1.1020 1.0968 1.0982 1.0981 1.1027 1.0955
irintensity: 3.1200 2.9821 0.3031 0.6374 0.2180 0.7046 0.4407 0.3539 0.1138 2.6356 0.1160 0.0656 0.9626 0.7410 8.8445 1.2971 6.0827 1.7116 1.1628 9.8466 9.7002 10.7627 9.0735 10.5790 3.2136 9.3167 4.1520 6.5082 9.5947 7.4906 5.9635 12.4480 15.0106 15.3518 32.2778 18.8352 20.4638 24.2002 13.3178 130.2778 12.7564 3.3775 5.0671 112.4936 53.3670 50.1049 650.1885 0.5044 130.2763 1.1847 100.0552 0.5299 106.6775 18.0356 50.7783 39.7501 192.1569 206.1003 115.5817 42.1747 155.8726 17.7272 16.9911 23.4377 17.5210 4.0386 150.7500 88.6012 10.5784 19.2115 9.2100 12.4141 26.0496 166.0069 55.0243 40.9625 213.9399 325.9948 237.7535 419.4972 33.6700 48.2501 95.6196 8.1132 28.9039 36.8565 24.4975 10.5532 24.5275 7.5416 19.1932 8.2477 8.6771 1.9023 1.7968 4.8352
temp: 298.150 k
press: 1.00000 atm
elementType: 8 8 8 7 7 7 7 6 6 6 6 6 6 6 6 6 6 6 1 1 1 1 1 1 1 1 1 1 1 1 1 1 1 1
symmnumber: 1
zpe: 701671.9 jmol-1
zpe.correction: 0.267253 hartree
zpe.thermalcorrener: 0.287196 hartree
zpe.thermalcorrenthalpy: 0.288140 hartree
zpe.thermalcorrgfe: 0.217247 hartree
zpe.sumelectzpe: -872.108733 hartree
zpe.sumelectthermal: -872.088789 hartree
zpe.sumelectthermalent: -872.087845 hartree
zpe.sumelectthermalfe: -872.158739 hartree
dipole: -3.3761 5.2695 2.4755
dipole: 6.7301
quadrupole: -85.8158 -113.6576 -108.8394
quadrupole: 14.0478 -6.7614 -0.9744
quadrupole: 16.9551 -10.8866 -6.0685 14.0478 -6.7614 -0.9744
hfenergy: -872.3759856 hartree
pointgroup: C01 [X(C11H16N4O3)]
dipole: 1.6474808 1.8698643 -0.8946146 debye
polarizability: 201.0821265|1.5203354|204.5970953|-4.7466197|3.8445013|101.9033536 unknown
InChI: InChI=1S/C11H16N4O3/c1-7-8(2)12-10(15(5)6-16)13-9(7)18-11(17)14(3)4/h6H,1-5H3
charge 0 multiplicity 1
34 atoms
O  1.925239 0.623685 -0.048557
O  2.074186 -0.861857 1.794639
O  -2.694421 -3.46562 -0.185401
N  -2.185751 1.213178 0.062647
N  -0.255632 -0.251935 -0.05786
N  -2.465801 -1.129289 -0.092332
N  3.560434 -1.02527 -0.021077
C  0.069774 2.166479 0.141447
C  -1.34985 2.29768 0.138555
C  0.540088 0.830696 0.036643
C  -1.599778 -0.016043 -0.022203
C  1.001699 3.350593 0.245299
C  -2.011931 3.651502 0.238982
C  2.492653 -0.510851 0.671292
C  -3.926912 -0.91014 -0.121598
C  4.359619 -2.087577 0.615341
C  3.973391 -0.601613 -1.368486
C  -1.96087 -2.445281 -0.113568
H  0.719392 4.009702 1.086599
H  2.0388 3.015028 0.398526
H  0.97634 3.968065 -0.673562
H  -3.100808 3.537117 0.13233
H  -1.800427 4.124864 1.217013
H  -1.639423 4.342851 -0.53939
H  -4.205833 -0.295757 -0.992844
H  -4.254737 -0.384695 0.789739
H  -4.398423 -1.903043 -0.183921
H  5.415017 -1.769671 0.711246
H  4.320356 -3.011738 0.008601
H  3.949322 -2.295891 1.61425
H  4.016837 -1.479783 -2.04037
H  4.977057 -0.135078 -1.337284
H  3.255136 0.123974 -1.770314
H  -0.858641 -2.473879 -0.057784
