program: Gaussian 09
title: 000185598
version: EM64L-G09RevD.01
frameworkgroup: C1[X(C17H19NO4)]
method: RPBEPBE
basis: SDD
operation: Freq
keyword: #p
keyword: freq=noraman
keyword: PBEPBE/SDD
title: #p freq=noraman PBEPBE/SDD
converged: NO YES NO NO
title: Mulliken charges:
elementType: O O O O N C C C C C C C C C C C C C C C C C H H H H H H H H H H H H H H H H H H H
charge: -0.311576 -0.265518 -0.251748 -0.229152 -0.064576 -0.164203 -0.280122 -0.433184 -0.454449 -0.564162 0.134035 0.241276 -0.640484 0.128188 0.182214 0.232204 -0.499794 -0.334475 -0.333326 -0.225427 -0.222638 -0.222320 0.236610 0.286904 0.226899 0.225412 0.221049 0.244356 0.274449 0.244882 0.204113 0.222239 0.232286 0.242704 0.234366 0.239505 0.269445 0.272671 0.234660 0.232865 0.233823
chargesum: 0.00000
title: Mulliken charges with hydrogens summed into heavy atoms:
elementType: O O O O N C C C C C C C C C C C C C C C C C
charge: -0.311576 -0.265518 -0.251748 -0.229152 -0.064576 0.072408 0.006782 0.019127 0.010955 -0.044831 0.134035 0.241276 0.018154 0.128188 0.182214 0.232204 0.216780 -0.065030 -0.060655 0.009233 0.010227 0.011503
polarizability: 2.64775438e+02 1.46212008e+00 1.75756606e+02 1.02488485e+00 1.32727449e+01 1.65782246e+02
1716.lowfreq: -14.6350 -4.0575 -0.0004 0.0003 0.0006 6.6685 15.8365 24.5443 28.2915
frequency: 14.0495 24.1485 28.2677 41.2502 59.5509 61.1535 104.0062 109.6686 118.4441 144.1405 151.3450 167.4128 187.0944 214.0215 224.2501 258.1908 274.8238 296.5351 326.9254 370.5954 372.7964 402.2564 402.8778 435.4563 453.5297 485.0430 505.1702 540.3722 553.2872 587.9623 614.0795 656.7954 671.2521 693.6226 699.5802 719.1153 737.3359 759.0773 784.6707 795.4438 805.5410 834.0139 848.1531 863.5509 881.0293 915.8871 949.1847 954.1780 974.3140 989.7031 992.0853 995.1325 1008.8205 1009.7990 1029.2054 1029.6592 1044.9147 1061.2539 1078.9526 1087.1233 1109.3497 1116.4722 1122.1135 1144.9094 1146.0472 1150.9319 1173.5123 1174.0946 1181.1568 1194.9206 1216.7933 1231.8540 1237.4321 1247.6811 1266.2886 1272.6605 1295.7281 1306.1170 1314.7499 1324.5697 1351.2272 1390.2445 1418.7104 1428.3909 1438.5791 1440.8035 1450.2919 1459.9130 1462.7466 1467.3974 1477.0931 1478.3442 1489.0364 1586.4766 1586.9603 1611.0250 1635.7270 1659.8951 2891.9342 2973.6605 3002.4559 3016.7073 3022.2343 3026.8996 3031.2221 3037.0381 3066.5414 3075.2962 3077.3158 3098.3240 3103.6245 3130.5939 3143.1719 3147.8259 3155.1829 3167.4006 3181.5570
redmass: 4.8180 4.6859 5.4809 4.3606 3.5988 5.7526 1.1678 3.1808 3.2017 4.4236 3.4872 4.3210 3.6770 3.4914 1.0467 3.4316 4.9545 5.1358 4.5933 2.7766 4.3945 3.5287 2.8200 4.1114 5.6359 4.5989 5.9903 6.0365 4.4570 4.8167 6.4389 6.0332 5.0689 3.2240 1.6254 5.9474 6.3893 5.8654 5.6997 2.1709 1.9807 2.2206 4.3080 1.2480 3.4708 3.1486 2.4124 1.4277 2.6508 5.9791 4.4134 1.4039 1.3319 2.5303 3.4203 2.3298 2.3679 2.1820 2.0964 1.9019 1.2905 3.0435 1.4149 1.5256 1.5147 1.7656 1.3632 1.0579 1.1402 1.4841 1.8869 1.6545 3.6367 2.4759 1.6392 1.4493 1.4387 1.5518 1.3181 1.7497 1.5778 10.1777 1.2007 1.1458 2.2438 1.0923 1.0512 1.0845 1.0530 1.0569 2.1857 1.1175 1.0502 8.2734 7.1749 6.0870 11.7143 8.6011 1.0531 1.0626 1.0294 1.0607 1.0766 1.0687 1.0962 1.0798 1.0885 1.1045 1.1006 1.1056 1.1044 1.0856 1.0892 1.1048 1.0941 1.0986 1.0970
irintensity: 0.7217 0.3862 1.2936 0.9946 0.4127 0.8094 0.9835 1.5335 1.5638 3.4129 0.7178 1.0533 2.4790 6.0199 0.3553 2.4878 7.4220 3.6139 4.3122 0.3890 0.7306 0.6497 0.0123 0.8379 0.9197 4.0608 19.8954 2.4660 0.3589 2.1681 1.0157 1.5669 20.5041 26.2016 79.4903 12.2243 18.3838 0.4648 16.3040 19.0895 17.1542 13.8427 9.9917 0.3092 3.3618 8.1156 36.0418 1.5028 24.0916 57.7944 84.3188 1.2233 0.0544 101.2486 82.9843 3.1178 174.7700 0.2025 92.3676 93.6062 4.5528 67.6306 5.7775 26.4842 18.7526 38.7333 10.7615 0.0692 50.3343 11.0199 23.8859 37.4636 490.9063 72.0706 40.5369 2.0422 8.1870 27.8162 1.1579 24.0518 29.1304 3.0374 27.4340 8.1033 16.1342 21.6103 10.3795 9.0996 7.7400 15.5635 9.7148 9.3680 3.0565 126.2520 63.6549 15.5205 170.6573 185.4260 79.2730 20.0200 34.2298 12.6247 57.2723 48.0086 7.5093 54.6313 4.2320 1.6738 23.2840 56.5040 22.5103 0.2412 9.9769 14.0704 16.0456 24.7532 5.8617
temp: 298.150 k
press: 1.00000 atm
elementType: 8 8 8 8 7 6 6 6 6 6 6 6 6 6 6 6 6 6 6 6 6 6 1 1 1 1 1 1 1 1 1 1 1 1 1 1 1 1 1 1 1
symmnumber: 1
zpe: 860158.8 jmol-1
zpe.correction: 0.327617 hartree
zpe.thermalcorrener: 0.348280 hartree
zpe.thermalcorrenthalpy: 0.349225 hartree
zpe.thermalcorrgfe: 0.275230 hartree
zpe.sumelectzpe: -1013.216133 hartree
zpe.sumelectthermal: -1013.195470 hartree
zpe.sumelectthermalent: -1013.194526 hartree
zpe.sumelectthermalfe: -1013.268520 hartree
dipole: 3.0840 -0.8903 1.2974
dipole: 3.4622
quadrupole: -114.6991 -127.5276 -125.2797
quadrupole: 10.5161 1.9181 -2.6455
quadrupole: 7.8031 -5.0254 -2.7776 10.5161 1.9181 -2.6455
hfenergy: -1013.5437507 hartree
pointgroup: C01 [X(C17H19N1O4)]
dipole: 1.2090312 0.2550565 -0.5732266 debye
polarizability: 264.6747725|-2.6365294|179.4334267|-2.0963789|11.3198987|162.2060905 unknown
InChI: InChI=1S/C17H19NO4/c1-18-12-8-9-13(18)15(17(20)21-2)14(10-12)22-16(19)11-6-4-3-5-7-11/h3-7,12-13H,8-10H2,1-2H3
charge 0 multiplicity 1
41 atoms
O  0.443212 0.319716 -0.634513
O  0.098449 -2.03417 0.701383
O  -1.970871 -3.011071 0.273936
O  0.999996 1.462942 1.331167
N  -3.722726 0.614367 -0.926426
C  -3.068689 1.85135 -0.407816
C  -3.258944 -0.415124 0.037357
C  -3.391836 1.771805 1.117381
C  -3.650367 0.247807 1.387699
C  -1.52535 1.824443 -0.66257
C  -1.723445 -0.620219 -0.023776
C  -0.955141 0.454532 -0.371647
C  -3.576257 0.317774 -2.360717
C  -1.240336 -1.984049 0.299243
C  1.362688 0.845059 0.30578
C  2.767664 0.569378 -0.100802
C  0.597224 -3.381596 1.068793
C  3.80853 1.100262 0.705671
C  3.082691 -0.205843 -1.247085
C  5.155092 0.860048 0.365902
C  4.432322 -0.442839 -1.582693
C  5.469299 0.08885 -0.779203
H  -3.503189 2.746222 -0.887708
H  -3.752037 -1.385982 -0.132865
H  -4.290258 2.366737 1.351694
H  -2.55633 2.163287 1.722816
H  -3.057706 -0.139439 2.233626
H  -4.71756 0.057731 1.590929
H  -1.02671 2.567062 -0.011041
H  -1.274542 2.098842 -1.707802
H  -2.527084 0.138761 -2.696121
H  -3.986646 1.159672 -2.947246
H  -4.164468 -0.58472 -2.604122
H  0.008573 -3.791394 1.906895
H  1.644527 -3.218801 1.359327
H  0.522608 -4.066946 0.207646
H  3.540146 1.691358 1.587617
H  2.270388 -0.615538 -1.853129
H  5.957561 1.270568 0.988019
H  4.677451 -1.041431 -2.466637
H  6.516468 -0.097509 -1.042964
