program: Gaussian 09
title: 000185849
version: EM64L-G09RevD.01
frameworkgroup: C1[X(C24H22O13)]
method: RPBEPBE
basis: SDD
operation: Freq
keyword: #p
keyword: freq=noraman
keyword: PBEPBE/SDD
title: #p freq=noraman PBEPBE/SDD
converged: YES YES NO NO
title: Mulliken charges:
elementType: O O O O O O O O O O O O O C C C C C C C C C C C C C C C C C C C C C C C C H H H H H H H H H H H H H H H H H H H H H H
charge: -0.283908 -0.295865 -0.292119 -0.277937 -0.289348 -0.294602 -0.277409 -0.218707 -0.195392 -0.189606 -0.212430 -0.204385 -0.222974 -0.053683 0.496602 0.372939 0.341849 0.088093 0.351937 0.400294 -0.520702 -0.561437 0.438223 -0.545350 -0.493351 0.273938 0.266683 0.263953 0.267736 0.256854 0.261549 -0.782335 -0.745905 -0.743702 -0.742338 -0.739025 -0.747531 0.288037 0.285423 0.330613 0.326225 0.282610 0.238066 0.301042 0.258237 0.254127 0.247503 0.252880 0.251017 0.251981 0.251589 0.252941 0.257161 0.258281 0.250976 0.252472 0.256352 0.246891 0.254968
chargesum: 0.00000
title: Mulliken charges with hydrogens summed into heavy atoms:
elementType: O O O O O O O O O O O O O C C C C C C C C C C C C C C C C C C C C C C C C
charge: -0.283908 -0.295865 -0.292119 -0.277937 -0.289348 -0.294602 -0.277409 -0.218707 -0.195392 -0.189606 -0.212430 -0.204385 -0.222974 -0.053683 0.496602 0.372939 0.341849 0.088093 0.351937 0.400294 -0.232665 -0.276014 0.438223 -0.214738 -0.167126 0.273938 0.266683 0.263953 0.267736 0.256854 0.261549 0.039383 0.013961 0.012177 0.019352 0.022704 0.010680
polarizability: 4.20774763e+02 -1.59473540e+01 3.00818683e+02 -1.81449849e+01 -1.42770965e+01 2.48908645e+02
1716.lowfreq: -3.5683 -2.7425 -0.0009 -0.0004 0.0004 2.8570 16.2928 21.0272 23.0819
frequency: 16.2752 21.0244 23.0652 27.9956 30.5244 31.6548 34.2199 37.1459 40.4338 42.7623 44.4252 46.0843 50.7251 55.1671 65.0347 69.4170 75.5312 78.4721 80.0131 82.9806 90.2572 93.3003 98.2451 101.6781 107.9215 125.5764 149.8052 167.8723 177.7531 192.7292 218.1006 246.1754 254.3985 257.8418 259.7089 262.5753 263.7600 277.3798 283.7053 287.1964 297.6488 326.1118 356.5951 363.4096 368.9704 380.3758 409.3217 476.6023 488.0591 495.7027 511.4170 521.2673 526.4669 532.0293 538.8790 542.0878 547.3330 553.8325 554.6570 556.2539 557.6389 568.2893 587.4178 611.2903 617.1684 636.6042 653.1394 664.2864 667.9722 677.7763 696.9192 717.3246 743.8460 761.1174 777.1641 780.0933 785.6794 796.9318 823.8843 850.1316 858.0640 879.0395 885.3951 906.2136 915.6701 970.2522 973.3905 977.5575 982.2925 983.7217 990.7197 994.6643 1000.8554 1006.8104 1026.5652 1037.6010 1040.1978 1040.3579 1040.4211 1040.8370 1051.3889 1082.4578 1095.2327 1140.2861 1147.5137 1154.7519 1158.9786 1163.8935 1179.7926 1185.1229 1193.7003 1200.0236 1205.9735 1285.7205 1309.6371 1370.0536 1381.9535 1383.2915 1384.1985 1384.7998 1385.2712 1385.9352 1401.5182 1419.1803 1430.2075 1450.6812 1451.0157 1451.3401 1451.8867 1452.0108 1452.5152 1452.7530 1452.8303 1452.8691 1453.1603 1455.2413 1459.4380 1463.3962 1468.4864 1580.2839 1598.6837 1603.9990 1623.2899 1661.2099 1670.0755 1681.5578 1686.1948 1697.8512 1700.4021 2988.8899 3009.2182 3010.0112 3010.2145 3010.4605 3011.0692 3086.9812 3097.3216 3097.9199 3098.6437 3099.0953 3100.1502 3138.0422 3145.2665 3145.9169 3146.5690 3147.1066 3147.8603 3174.2005 3188.1579 3217.4422 3219.7745
redmass: 6.5206 7.2428 7.2381 5.2711 8.0461 4.1388 5.3003 3.1101 4.4684 1.4842 2.1208 2.5551 2.0504 2.5480 2.5612 4.4899 2.0419 3.1365 2.3543 1.4520 1.4969 2.5540 4.5409 5.6153 4.4943 6.7520 6.4873 8.2963 1.0360 6.3801 9.5945 7.7496 7.1287 5.6138 5.0950 5.6615 4.9561 3.7515 5.9099 4.5047 6.8490 5.5163 5.0747 4.9606 4.7499 7.0812 5.1295 5.4748 5.0187 4.7467 5.2660 5.0341 5.4973 4.6951 4.0370 3.3613 4.1059 3.2265 3.3548 3.3768 3.7427 5.0012 6.8119 4.2091 5.0452 6.6836 5.1183 5.7970 6.2070 5.5386 4.8740 5.5753 5.9120 7.1447 5.7683 5.2351 5.7787 7.0035 5.8978 6.9641 6.9817 1.5300 1.8486 1.4131 1.5281 3.2808 3.9029 2.7095 2.3002 2.2557 2.2474 2.2204 4.9535 2.6834 7.1345 1.6533 1.6406 1.6523 1.6511 1.6554 1.6102 2.6729 2.3922 2.5111 2.6926 2.9624 3.0341 3.4542 3.1294 3.5241 3.6181 1.4008 1.4931 7.7304 8.8456 9.5014 3.7081 1.3972 1.2407 1.2386 1.3550 1.2425 1.2204 5.0345 5.1273 1.0557 1.0555 1.0584 1.0753 1.0523 1.0539 1.0749 1.0575 1.0468 1.0566 1.0599 3.3510 1.0650 4.1212 8.6843 9.1173 8.8603 8.5338 9.7331 10.2080 10.3102 10.3139 10.6020 10.6571 1.0422 1.0368 1.0371 1.0371 1.0373 1.0369 1.0897 1.0972 1.0967 1.0970 1.0962 1.0964 1.1027 1.1017 1.1012 1.1014 1.1017 1.1013 1.0930 1.0937 1.0929 1.0934
irintensity: 0.1118 0.1275 0.1972 0.2839 2.3437 0.4740 1.2062 3.7215 0.0373 1.7757 0.5436 1.5220 0.7296 4.8272 3.5293 3.2413 1.6166 6.4654 0.4926 1.1705 2.4410 0.4026 2.8976 0.7901 0.8666 0.1533 3.2638 1.0455 0.6560 2.3310 1.4784 2.4171 1.8355 1.4995 2.9302 7.9675 9.3415 0.4247 3.0407 1.8746 1.8283 2.3259 2.3263 5.3040 3.6999 5.8910 4.9023 6.5426 17.3506 18.3814 4.8113 16.5008 8.3800 3.4437 3.0668 7.6028 1.9291 3.6643 1.8188 8.1825 2.1959 4.2615 5.0654 8.7456 7.7817 12.7652 7.2106 1.7332 20.3978 15.3867 8.6639 11.8505 17.8925 25.0887 22.8885 40.3694 47.3049 23.7212 26.7927 87.0926 80.5146 5.7086 48.5230 10.4798 60.9788 11.4924 63.2195 7.9037 34.3683 71.5348 99.5693 86.4884 283.3752 382.8765 518.8453 15.0776 6.4726 6.8986 12.5481 5.4632 27.7805 84.1036 26.9668 377.6359 343.3015 546.9518 491.2900 989.8193 63.6444 129.3296 9.2699 1.3648 36.8009 10.4600 14.8215 31.8631 19.8408 23.2195 100.9119 46.4620 81.0700 78.0511 48.1347 57.8271 18.0216 30.1867 1.8974 43.6287 13.1486 20.8888 14.8415 92.9845 23.1680 16.0941 30.6142 20.5549 431.4993 30.4655 84.0604 61.2484 31.6377 11.4028 181.3307 186.5368 219.3043 32.4324 233.4047 155.1541 215.0304 21.9073 0.8770 1.0425 1.4883 0.5891 0.7981 3.5877 5.4267 5.0333 5.1213 5.6729 6.4775 7.2771 9.1855 11.3437 9.2935 7.7813 7.4884 0.2085 0.5547 14.6497 16.1914
temp: 298.150 k
press: 1.00000 atm
elementType: 8 8 8 8 8 8 8 8 8 8 8 8 8 6 6 6 6 6 6 6 6 6 6 6 6 6 6 6 6 6 6 6 6 6 6 6 6 1 1 1 1 1 1 1 1 1 1 1 1 1 1 1 1 1 1 1 1 1 1
symmnumber: 1
zpe: 1102859.0 jmol-1
zpe.correction: 0.420057 hartree
zpe.thermalcorrener: 0.460039 hartree
zpe.thermalcorrenthalpy: 0.460983 hartree
zpe.thermalcorrgfe: 0.338869 hartree
zpe.sumelectzpe: -1902.967613 hartree
zpe.sumelectthermal: -1902.927630 hartree
zpe.sumelectthermalent: -1902.926686 hartree
zpe.sumelectthermalfe: -1903.048800 hartree
dipole: -4.3265 -1.9640 -2.0363
dipole: 5.1694
quadrupole: -172.1238 -200.5436 -212.5775
quadrupole: -5.6112 -5.8085 13.3984
quadrupole: 22.9578 -5.4619 -17.4959 -5.6112 -5.8085 13.3984
hfenergy: -1903.3876694 hartree
pointgroup: C01 [X(C24H22O13)]
dipole: 1.7599401 0.8236137 0.6004779 debye
polarizability: 417.5162645|-30.3985196|248.5017795|-14.4274083|-3.5806577|304.4840471 unknown
InChI: InChI=1S/C24H22O13/c1-11(25)31-17-7-21(34-14(4)28)24(22(8-17)35-15(5)29)37-18-9-19(32-12(2)26)23(36-16(6)30)20(10-18)33-13(3)27/h7-10H,1-6H3
charge 0 multiplicity 1
59 atoms
O  -0.831854 -0.338558 -1.528248
O  -0.928274 -1.383295 1.018321
O  -2.952844 1.135641 -2.553072
O  4.364697 0.571216 0.460195
O  2.265927 2.261571 1.271359
O  3.888928 -1.423963 -1.483349
O  -5.511002 0.184528 1.572578
O  -1.561779 -1.888655 3.23198
O  -2.971499 -0.940113 -3.656899
O  5.157338 1.567302 -1.51835
O  2.249209 0.756852 3.071889
O  3.181515 -3.240445 -0.166934
O  -6.941777 1.471604 0.209003
C  -1.968822 -0.147228 -0.717745
C  0.45398 -0.051805 -1.012591
C  -2.090164 -0.706627 0.587943
C  -3.077279 0.522763 -1.276827
C  3.072372 0.399869 -0.095912
C  2.001582 1.200096 0.355526
C  2.801298 -0.62415 -1.028852
C  0.688666 0.993349 -0.095004
C  1.501118 -0.854655 -1.502526
C  -4.367097 0.130078 0.722608
C  -3.287739 -0.562689 1.31545
C  -4.287784 0.676921 -0.57605
C  -0.692692 -1.879793 2.341463
C  -2.832363 0.29062 -3.706109
C  5.381984 1.150234 -0.373834
C  2.416967 1.912715 2.647854
C  3.981241 -2.765183 -0.989923
C  -6.725733 0.842179 1.263219
C  0.741235 -2.323817 2.444746
C  -2.532958 1.148806 -4.909812
C  6.688837 1.145754 0.380429
C  2.779106 3.144803 3.438441
C  5.159639 -3.448716 -1.638082
C  -7.688125 0.64402 2.411401
H  -0.123249 1.623413 0.277664
H  1.286633 -1.664737 -2.202964
H  -3.391571 -0.983503 2.315032
H  -5.121469 1.207623 -1.033836
H  1.106853 -2.762078 1.502593
H  0.843968 -3.039833 3.274028
H  1.369696 -1.437801 2.66299
H  -1.500598 1.534939 -4.836132
H  -3.208893 2.01914 -4.941473
H  -2.633947 0.551832 -5.827381
H  7.018697 0.105425 0.548784
H  7.452943 1.686448 -0.195699
H  6.560574 1.609929 1.372686
H  2.843881 2.896085 4.50695
H  3.745859 3.545323 3.087128
H  2.023708 3.933196 3.279487
H  4.95032 -3.608744 -2.71082
H  5.341076 -4.418241 -1.153021
H  6.057721 -2.812413 -1.574071
H  -7.90899 -0.430391 2.537184
H  -8.618894 1.19297 2.210036
H  -7.23657 0.996787 3.354251
