program: Gaussian 09
title: 000185551
version: EM64L-G09RevD.01
frameworkgroup: C1[X(C7H13N3)]
method: RPBEPBE
basis: SDD
operation: Freq
keyword: #pfreq=noraman
keyword: PBEPBE/SDD
title: #p freq=noraman PBEPBE/SDD
converged: NO YES NO NO
title: Mulliken charges:
elementType: N N N C C C C C C C H H H H H H H H H H H H H
charge: -0.132768 -0.132926 -0.132789 -0.231275 -0.438215 -0.395274 -0.395129 -0.438142 -0.438094 -0.395162 0.257756 0.230360 0.252627 0.244860 0.229661 0.244870 0.229587 0.230290 0.252573 0.230301 0.252467 0.244869 0.229553
chargesum: 0.00000
title: Mulliken charges with hydrogens summed into heavy atoms:
elementType: N N N C C C C C C C
charge: -0.132768 -0.132926 -0.132789 0.026481 0.044772 0.079248 0.079328 0.044721 0.044674 0.079260
polarizability: 9.49140564e+01 -3.43234688e-03 9.49117051e+01 -1.87340402e-03 -1.00054989e-03 8.61534146e+01
1716.lowfreq: -15.3379 -6.6380 -0.0003 0.0006 0.0007 5.1361 80.3866 85.0893 90.9830
frequency: 80.3252 85.0801 90.9681 170.3164 173.3567 202.7725 304.2355 333.6874 339.0595 467.0561 468.4777 534.5290 741.9421 742.2004 749.8261 803.8782 804.9722 814.1953 830.5101 831.6125 867.5485 954.7792 986.8476 988.8770 1007.1589 1007.7971 1045.5603 1068.2844 1068.8944 1076.2037 1095.4316 1096.1688 1103.2167 1118.9596 1130.5654 1132.1863 1145.8542 1146.8640 1151.0893 1253.8263 1254.1639 1256.0947 1302.7573 1303.7793 1431.8078 1432.4900 1436.5787 1447.2284 1452.7920 1455.7963 3014.6725 3069.1133 3069.4853 3070.1729 3083.1909 3083.4688 3083.8244 3176.2365 3176.5774 3176.9380 3195.8122 3196.1098 3196.4896
redmass: 2.7894 2.8070 3.1837 3.3300 3.3325 2.3260 3.6901 2.8449 2.8659 3.7870 3.7939 3.9970 3.5573 3.6043 5.2260 1.5885 1.6611 1.0823 2.6060 2.3952 3.8630 2.2200 1.1290 1.1316 3.1831 3.0938 1.4979 1.2664 1.2661 1.2567 1.3043 1.3032 1.3134 1.5651 1.5420 1.5388 1.3652 1.3619 1.4661 3.8227 3.8540 3.4340 1.1621 1.1611 1.0802 1.0791 1.0782 1.2043 1.1932 1.1951 1.0849 1.0502 1.0500 1.0499 1.0559 1.0557 1.0557 1.1183 1.1183 1.1180 1.1180 1.1179 1.1179
irintensity: 0.8603 0.7602 5.1054 4.9240 4.9106 0.9737 0.3444 3.0359 2.9522 4.9258 5.0810 1.6047 18.9549 18.6844 0.3920 10.5074 10.3677 0.1864 8.6902 8.8262 0.3446 9.4771 11.6020 12.3266 133.1883 131.8384 6.4996 5.8908 6.3391 4.5945 2.2062 2.4698 19.7424 1.4936 9.3901 9.4406 0.2797 0.2161 0.0154 92.5271 93.5100 4.9229 7.9709 7.9120 0.4638 8.3059 9.6728 0.0713 0.9346 0.8252 25.0515 32.5390 34.3735 36.7174 24.8288 24.5272 36.7305 4.4468 4.1734 1.7273 34.6453 35.6348 6.9430
temp: 298.150 k
press: 1.00000 atm
elementType: 7 7 7 6 6 6 6 6 6 6 1 1 1 1 1 1 1 1 1 1 1 1 1
symmnumber: 1
zpe: 510690.0 jmol-1
zpe.correction: 0.194512 hartree
zpe.thermalcorrener: 0.204597 hartree
zpe.thermalcorrenthalpy: 0.205541 hartree
zpe.thermalcorrgfe: 0.159061 hartree
zpe.sumelectzpe: -437.834898 hartree
zpe.sumelectthermal: -437.824813 hartree
zpe.sumelectthermalent: -437.823869 hartree
zpe.sumelectthermalfe: -437.870349 hartree
dipole: -0.0024 0.0030 0.5365
dipole: 0.5365
quadrupole: -60.1956 -60.1960 -57.5047
quadrupole: 0.0026 -0.0037 0.0002
quadrupole: -0.8968 -0.8972 1.7940 0.0026 -0.0037 0.0002
hfenergy: -438.0294096 hartree
pointgroup: C01 [X(C7H13N3)]
dipole: 0.0154304 0.0196241 0.2096036 debye
dipolederiv: -0.9491885 -0.2362629 -0.040662 -0.1628698 -0.5829995 -0.0403321 -0.1539979 -0.029416 -0.094188 -0.786576 0.2068218 0.1826136 0.3023549 -0.6991827 -0.0348983 0.2229361 -0.1225583 -0.1411787 -0.4991491 -0.0827705 0.0177488 -0.0009834 -0.9484042 0.2371787 0.0667022 0.3333121 -0.1790511 1.1355425 0.2642755 -0.0935814 -0.2752621 1.133115 -0.0573756 -0.043149 -0.1007815 0.2952175 0.1829967 -0.0396648 0.1099446 -0.0053085 0.1766832 -0.0319888 0.1006987 -0.0492718 -0.0014026 0.215555 -0.0883631 -0.0540795 -0.0207724 0.1148649 0.016998 -0.0057792 0.0570481 -0.0085541 0.0821713 -0.0559498 -0.0019668 0.0013658 0.2310467 -0.0737513 -0.0653747 -0.0385961 0.0087638 0.1460613 0.0098779 -0.0583307 0.0444932 0.2154252 0.0896546 -0.0411832 0.0968095 -0.0018415 0.1914072 -0.0236921 -0.0859939 0.0066931 0.1262855 -0.1071439 -0.1027337 -0.0890944 0.0418161 0.1895302 0.043061 0.0253499 0.1134928 0.1402981 0.0023941 0.0217556 -0.0569107 -0.0072419 -0.0212297 -0.0494326 -0.0053557 0.0473843 -0.0213764 -0.0153927 -0.0143873 -0.0075594 -0.1432034 -0.0089339 0.0455554 -0.086284 0.0893235 0.0454876 0.0594385 -0.1179079 0.013961 -0.0408113 0.085967 0.0849972 0.0366335 0.0346711 -0.0061579 -0.0857368 0.025173 -0.0686362 0.0155803 0.0772061 0.0520264 -0.0233214 -0.0168588 -0.0361223 0.1038667 0.0054228 0.087207 0.0492455 -0.1166526 0.0259208 0.103738 0.0670818 0.0527162 -0.0142753 0.1134751 0.0167473 0.0359538 -0.0217631 -0.0351532 -0.0616563 -0.1089698 0.027966 -0.0486892 -0.0563261 -0.0299142 0.0840349 0.0283517 0.0440663 -0.0410437 0.0834442 -0.1023946 0.0921287 -0.0756554 0.0933913 0.0459936 0.0924281 -0.0557257 -0.0318258 -0.0080569 -0.0680879 -0.1029233 0.0202666 -0.0987217 -0.0289255 0.0866585 -0.0298876 0.0437052 -0.07582 0.0218238 0.0902359 0.0379964 0.0621812 -0.0134271 -0.0194199 -0.0550821 0.1072266 -0.0191474 0.0870621 0.0186091 0.0749162 0.0701856 -0.0719949 -0.0417586 0.0143548 -0.0956755 -0.0305153 0.114897 -0.0089977 -0.0648074 -0.0088009 0.0212034 -0.0171742 0.0921424 0.0871104 0.0196046 0.0471052 -0.0320597 0.0732815 -0.0513965 0.0602074 -0.03203 -0.1311151 -0.0342937 -0.085345 -0.0700511 -0.0569397 -0.0213225 -0.0791853 0.0738039 unknown
polarizability: 94.8595238|-0.0636831|94.8336006|-0.6980533|-0.8106488|86.2860517 unknown
InChI: InChI=1S/C7H13N3/c1-2-8(1)7(9-3-4-9)10-5-6-10/h7H,1-6H2
charge 0 multiplicity 1
23 atoms
N  1.360312 -0.390812 -0.531026
N  -0.512942 1.231977 -0.531929
N  -0.971569 -1.189116 -0.268842
C  -0.074793 -0.154803 -0.858146
C  2.049131 0.510349 0.466939
C  2.353246 0.629594 -1.018073
C  -1.962523 1.567483 -0.757505
C  -1.415579 1.462183 0.657329
C  -0.488601 -2.004861 0.907578
C  -0.590187 -2.630165 -0.474671
H  -0.163619 -0.257934 -1.956801
H  2.754386 0.003888 1.13424
H  1.465338 1.326278 0.905273
H  1.94745 1.518112 -1.517576
H  3.281939 0.219204 -1.427603
H  -2.618011 0.748058 -1.077396
H  -2.150531 2.548198 -1.206387
H  -1.197595 2.368552 1.232014
H  -1.735108 0.587358 1.233029
H  -1.250966 -2.216474 1.664713
H  0.524757 -1.817769 1.277654
H  0.363179 -2.824293 -0.981487
H  -1.419313 -3.30251 -0.717927
