program: Gaussian 09
title: 000185536
version: EM64L-G09RevD.01
frameworkgroup: C1[X(C12H15N5O3S)]
method: RPBEPBE
basis: SDD
operation: Freq
keyword: #p
keyword: freq=noraman
keyword: PBEPBE/SDD
title: #p freq=noraman PBEPBE/SDD
converged: YES YES NO NO
title: Mulliken charges:
elementType: S O O O N N N N N C C C C C C C C C C C C H H H H H H H H H H H H H H H
charge: 0.199721 -0.273698 -0.449148 -0.214204 -0.397518 -0.396389 -0.002718 -0.022159 0.044433 -0.362286 -0.294733 -0.540164 -0.690774 0.254537 -0.317691 0.309332 -0.081035 -0.387103 -0.216504 -0.395572 0.181665 0.208386 0.238397 0.204795 0.237000 0.212890 0.232862 0.265402 0.295643 0.352210 0.279901 0.281827 0.330649 0.268241 0.248495 0.395309
chargesum: 0.00000
title: Mulliken charges with hydrogens summed into heavy atoms:
elementType: S O O O N N N N N C C C C C C C C C C C C
charge: 0.199721 -0.273698 -0.053839 -0.214204 -0.045307 -0.065741 -0.002718 -0.022159 0.044433 0.084497 0.147062 -0.094412 -0.129728 0.254537 -0.317691 0.309332 -0.081035 0.174625 0.051737 -0.147077 0.181665
polarizability: 2.67243788e+02 -1.37530693e+01 1.99710855e+02 3.24097340e+01 4.90900684e+00 1.17189922e+02
1716.lowfreq: -2.7838 -0.0011 -0.0010 0.0014 2.7200 5.0862 11.7226 13.0814 18.9993
frequency: 10.8775 13.0620 18.9600 30.8526 41.6511 45.1434 69.0142 97.1684 110.4252 118.9583 137.0078 143.2947 174.2810 195.9994 220.8771 248.3221 267.6741 278.5242 285.7366 377.4247 385.2551 391.8627 490.7461 500.5958 511.8762 538.8192 544.1007 574.2637 587.2009 602.0273 614.3187 621.1444 649.6363 651.4336 652.7045 678.6390 713.8994 730.0276 771.0008 793.0433 797.5904 819.7938 842.1082 887.5679 903.8384 922.2828 924.7214 940.4736 978.5365 1026.0480 1044.0305 1058.0245 1073.7344 1074.7069 1080.7214 1103.2336 1121.6293 1141.1701 1166.8322 1207.1541 1215.1666 1228.5963 1236.6709 1255.7299 1268.8226 1277.4773 1294.8161 1297.1201 1302.0773 1307.7490 1322.7250 1337.4958 1344.2655 1348.7215 1355.1722 1404.6229 1423.3595 1433.2811 1447.3479 1458.2112 1466.6184 1478.6769 1483.2755 1489.9899 1579.7359 1609.5484 1685.3989 2977.6333 2984.3142 2991.1073 2994.1485 3027.1919 3027.6995 3031.1707 3042.3570 3066.7316 3112.0078 3170.1436 3237.6065 3530.6013 3558.0710 3582.6354
redmass: 7.1818 7.1945 6.2916 6.1761 4.7250 7.5212 3.9546 3.4272 3.0162 4.2124 3.1162 8.0774 2.9184 3.1431 6.2877 4.5005 5.7847 5.8675 5.1440 4.3353 5.2121 9.5910 1.8987 6.6417 3.9871 5.1981 4.2016 9.3274 1.8158 4.7296 1.6674 1.5210 2.5451 7.4863 1.4765 5.9078 4.5521 1.1240 1.3133 7.2703 10.2859 4.5982 1.5219 1.4422 7.7507 1.4337 7.0529 5.9664 2.0373 4.4814 3.9903 1.7007 2.1399 2.6051 2.0749 1.7418 4.0578 1.8930 3.8527 1.0999 1.5050 1.2761 2.6328 1.3228 3.3890 1.4490 1.1667 1.3304 4.4886 1.7007 1.4008 2.6427 1.5474 2.7534 1.6113 1.7008 1.1115 3.2936 1.1002 1.1001 1.0797 2.1403 1.0968 8.6290 8.0985 6.8112 9.2355 1.0593 1.0607 1.0602 1.0595 1.0991 1.0967 1.0608 1.1009 1.1041 1.1073 1.0921 1.0991 1.0644 1.0785 1.0824
irintensity: 2.5719 1.5852 1.0667 10.2465 2.2430 0.0631 0.6558 1.0580 1.2178 7.5533 5.7649 5.9246 3.8235 3.4142 0.4043 2.0955 6.0170 10.0270 0.8165 10.3444 9.3847 1.6161 45.8326 8.1522 17.5547 0.2942 40.2706 10.4369 25.3061 36.3743 17.4238 82.0852 11.7820 4.5998 202.7351 19.2395 2.9674 12.6695 1.3795 0.0766 23.9820 16.9852 17.2956 2.6418 4.3285 13.2625 66.4951 45.4213 0.7813 2.1584 4.3329 0.6036 32.1687 8.7252 201.5066 10.8987 3.6340 3.9440 7.6369 0.5368 11.7687 18.7770 42.2111 4.7086 53.7163 19.5079 2.7398 8.1881 57.3093 47.6199 17.3792 185.1469 6.2178 13.0717 7.3043 5.5714 18.6503 55.1847 7.9782 7.1143 2.7393 410.4017 19.8586 160.9910 81.2271 156.0661 279.0406 7.5137 2.1140 25.6390 45.2288 4.5999 4.1115 22.8719 1.6104 46.0880 5.7968 15.3056 0.9981 32.6942 59.6124 55.4020
temp: 298.150 k
press: 1.00000 atm
elementType: 16 8 8 8 7 7 7 7 7 6 6 6 6 6 6 6 6 6 6 6 6 1 1 1 1 1 1 1 1 1 1 1 1 1 1 1
symmnumber: 1
zpe: 715894.0 jmol-1
zpe.correction: 0.272670 hartree
zpe.thermalcorrener: 0.293384 hartree
zpe.thermalcorrenthalpy: 0.294328 hartree
zpe.thermalcorrgfe: 0.216860 hartree
zpe.sumelectzpe: -1362.228807 hartree
zpe.sumelectthermal: -1362.208092 hartree
zpe.sumelectthermalent: -1362.207148 hartree
zpe.sumelectthermalfe: -1362.284616 hartree
dipole: -0.9141 -1.5418 -3.1856
dipole: 3.6553
quadrupole: -145.4253 -140.1337 -127.0552
quadrupole: 46.7106 2.5553 0.5158
quadrupole: -7.8872 -2.5957 10.4829 46.7106 2.5553 0.5158
hfenergy: -1362.5014763 hartree
pointgroup: C01 [X(C12H15N5O3S1)]
dipole: 0.3132684 -1.0894527 -0.8849042 debye
polarizability: 265.9753353|-38.1332152|120.8211883|3.8862248|-13.0199882|197.3480418 unknown
InChI: InChI=1S/C12H15N5O3S/c18-8(13-5-9(19)20)3-1-2-4-21-12-10-11(15-6-14-10)16-7-17-12/h6-7,13-14,19H,1-5H2
charge 0 multiplicity 1
36 atoms
S  2.566656 0.237196 -1.834135
O  -4.530137 0.668158 -1.7327
O  -6.243869 -1.210754 2.398344
O  -8.239481 -0.160225 1.825985
N  -4.920471 -0.423897 0.269504
N  5.45829 -0.997877 -0.571878
N  2.345537 0.459373 0.924006
N  6.097006 -1.170403 1.624089
N  4.02242 -0.197299 2.594658
C  -1.629383 0.440297 -1.098067
C  -0.216647 -0.164347 -1.274592
C  -2.683309 -0.640886 -0.760145
C  0.819002 0.931308 -1.565022
C  -4.105279 -0.07252 -0.791286
C  3.126441 0.060095 -0.110674
C  4.39683 -0.488617 0.177049
C  4.809919 -0.601604 1.550515
C  -6.306227 0.041735 0.322212
C  6.442332 -1.388806 0.345268
C  2.82612 0.314621 2.208969
C  -7.051918 -0.424842 1.557911
H  -1.612963 1.202061 -0.293547
H  -1.951346 0.95635 -2.022198
H  -0.228648 -0.90221 -2.100841
H  0.082847 -0.701896 -0.355124
H  -2.459723 -1.109571 0.217749
H  -2.630616 -1.442148 -1.524486
H  0.603089 1.481465 -2.496946
H  0.9047 1.635798 -0.721599
H  -4.583465 -1.005838 1.038544
H  -6.871723 -0.294967 -0.568955
H  -6.353211 1.14815 0.289274
H  5.507484 -1.070767 -1.58775
H  7.387319 -1.824899 0.02756
H  2.157231 0.655683 3.004101
H  -6.76381 -1.496412 3.196604
