program: Gaussian 09
title: 000185514
version: EM64L-G09RevD.01
frameworkgroup: C1[X(C18H19N3)]
method: RPBEPBE
basis: SDD
operation: Freq
keyword: #pfreq=noraman
keyword: PBEPBE/SDD
title: #p freq=noraman PBEPBE/SDD
converged: YES YES NO NO
title: Mulliken charges:
elementType: N N N C C C C C C C C C C C C C C C C C C H H H H H H H H H H H H H H H H H H H
charge: -0.181987 -0.063140 -0.024838 -0.396832 -0.427327 -0.384057 -0.371697 0.383752 0.259652 -0.614027 -0.076513 -0.335941 -0.590789 0.384800 0.414870 -0.553180 -0.396327 -0.434365 -0.409140 -0.243915 -0.243319 0.228278 0.211132 0.233086 0.251972 0.213781 0.191448 0.185317 0.214581 0.190471 0.224893 0.225035 0.236324 0.259550 0.267132 0.231620 0.239596 0.244851 0.227168 0.228085
chargesum: 0.00000
title: Mulliken charges with hydrogens summed into heavy atoms:
elementType: N N N C C C C C C C C C C C C C C C C C C
charge: -0.181987 -0.063140 -0.024838 0.042578 0.057731 0.021173 0.028200 0.383752 0.259652 0.026372 -0.076513 -0.099617 -0.331239 0.384800 0.414870 -0.286048 -0.164706 -0.194769 -0.164289 -0.016746 -0.015234
polarizability: 3.28292630e+02 -3.51005843e+01 2.72745781e+02 3.98743051e+00 2.77696280e+00 1.11929292e+02
1716.lowfreq: -8.3337 -1.7666 -0.0004 0.0003 0.0006 15.4079 40.7197 57.7176 64.9738
frequency: 40.5151 57.6754 64.6451 99.0297 124.0303 145.7987 201.9136 210.6653 224.1465 233.8438 256.9002 282.1471 303.0889 320.7671 329.8258 356.1426 393.7660 396.5505 424.7362 473.1016 482.0030 492.2012 504.4145 510.2707 550.0884 585.7553 610.4149 622.3649 640.2011 654.7714 703.1344 750.0701 757.9489 766.2055 772.5411 790.1132 815.8050 826.7876 851.0553 860.3479 894.9822 905.6881 913.1674 924.7149 932.3809 945.6360 968.3268 989.6139 1007.9162 1013.9456 1018.5949 1050.5016 1063.9972 1069.6961 1076.0330 1082.9395 1127.0357 1141.6280 1150.7893 1152.7340 1163.7407 1170.8244 1197.3516 1213.4983 1225.2941 1244.5291 1259.4450 1275.8175 1286.4594 1294.0414 1310.6537 1338.7566 1346.4367 1351.4614 1361.6242 1370.7977 1376.4659 1384.5546 1397.0579 1410.7092 1431.4346 1437.8393 1447.7697 1453.3511 1458.5072 1460.6558 1468.2694 1473.8660 1481.0800 1481.4150 1529.7369 1553.2133 1565.9853 1603.0069 1637.6591 2841.2796 2852.4387 2869.4042 2921.5443 2935.0903 3020.1316 3028.0653 3032.3478 3058.7177 3077.8164 3097.1165 3111.3319 3118.0939 3126.1325 3133.4523 3142.7280 3151.3371 3161.5842 3164.2730
redmass: 4.0535 4.0186 3.2624 4.5797 3.8141 3.6853 3.9419 3.5420 1.2482 4.3244 3.0093 3.2504 3.4719 2.5927 2.8136 2.8828 4.5478 2.4799 2.9109 3.0138 2.6283 4.6401 3.7999 3.9345 4.8385 3.8502 4.3070 4.2669 4.0541 4.5539 4.4415 3.5419 1.3119 4.1557 3.8426 2.4355 4.1301 1.5128 1.5358 1.4514 4.9111 2.1143 2.3309 1.8275 2.0180 1.4609 1.4106 1.3442 2.4387 2.3741 2.6083 1.6405 2.3123 1.7067 2.1762 1.8482 1.5975 1.9953 2.5377 2.7608 1.5338 1.0828 1.0915 1.7087 1.6996 1.8198 1.9912 1.6914 1.6408 1.4673 2.4766 1.3701 2.3191 1.5766 1.7822 1.4213 1.5215 2.3337 3.5089 2.5877 1.1716 6.2468 2.9961 1.0803 1.1417 1.0694 1.1430 1.1209 2.5721 1.0693 5.8714 5.7568 6.3190 6.4406 6.9114 1.0702 1.0662 1.0598 1.0678 1.0710 1.0736 1.0882 1.0900 1.0926 1.1010 1.0908 1.0895 1.0862 1.0880 1.0901 1.0953 1.0919 1.1003 1.0931
irintensity: 0.0066 0.1978 0.5491 1.3297 2.3060 4.5288 1.3626 4.7806 0.1699 2.4181 0.6209 1.7272 3.7634 1.3530 11.0195 0.4582 0.9471 1.8309 1.4239 6.1563 18.5668 1.7212 5.2222 0.4823 1.3710 5.7125 3.7577 2.1422 5.3376 2.3858 11.2204 6.2696 57.4236 3.2506 1.0154 5.6055 4.1891 21.2232 3.5441 0.5796 30.5521 56.4895 25.0909 1.0577 2.7064 4.4440 12.5061 0.1938 71.0915 5.7571 5.1995 7.7878 1.2304 6.4269 5.9568 4.7911 21.8770 12.7936 52.4720 16.3579 3.9564 0.3577 9.2956 4.2725 35.4156 20.9003 31.0941 3.8059 28.8938 14.8487 9.8306 15.3477 18.7579 2.4280 12.2813 35.3069 0.8005 26.5714 30.5275 32.6653 2.7397 23.6158 32.0854 0.9042 29.1132 18.6846 34.2242 20.0907 37.8617 7.7087 110.1910 62.4793 87.7618 18.7128 3.5601 60.6461 47.9055 184.4154 69.5464 87.2826 50.4246 46.9852 55.9096 21.8336 30.4780 9.4789 36.1156 2.2590 0.1417 5.4305 32.4487 4.1975 48.9318 19.6850
temp: 298.150 k
press: 1.00000 atm
elementType: 7 7 7 6 6 6 6 6 6 6 6 6 6 6 6 6 6 6 6 6 6 1 1 1 1 1 1 1 1 1 1 1 1 1 1 1 1 1 1 1
symmnumber: 1
zpe: 868622.2 jmol-1
zpe.correction: 0.330841 hartree
zpe.thermalcorrener: 0.347679 hartree
zpe.thermalcorrenthalpy: 0.348623 hartree
zpe.thermalcorrgfe: 0.286700 hartree
zpe.sumelectzpe: -860.063335 hartree
zpe.sumelectthermal: -860.046497 hartree
zpe.sumelectthermalent: -860.045553 hartree
zpe.sumelectthermalfe: -860.107476 hartree
dipole: -3.5044 -3.0583 -0.3254
dipole: 4.6626
quadrupole: -109.4739 -120.6192 -128.7324
quadrupole: -7.1439 3.7591 -0.8910
quadrupole: 10.1346 -1.0107 -9.1239 -7.1439 3.7591 -0.8910
hfenergy: -860.3941759 hartree
pointgroup: C01 [X(C18H19N3)]
dipole: -1.3391049 -1.2536653 -0.013732 debye
polarizability: 329.5851351|-31.7039713|268.5224128|16.4576813|-19.1089754|114.860155 unknown
InChI: InChI=1S/C18H19N3/c1-20-8-10-21(11-9-20)18-6-7-19-17-13-15-5-3-2-4-14(15)12-16(17)18/h2-7,12-13H,8-11H2,1H3
charge 0 multiplicity 1
40 atoms
N  -2.071525 0.349142 -0.134957
N  -4.394436 -1.330742 0.222629
N  1.22675 3.136984 -0.29245
C  -3.380378 0.746268 -0.699488
C  -2.246101 -0.478068 1.093122
C  -4.219579 -0.510824 -0.997511
C  -3.081683 -1.72858 0.780207
C  -0.988819 1.251666 -0.219675
C  0.387924 0.770757 -0.099048
C  -5.294078 -2.480027 0.009794
C  1.457184 1.769259 -0.101023
C  -1.17225 2.620997 -0.47741
C  0.73772 -0.598679 -0.060045
C  2.085923 -1.022777 0.066243
C  3.143164 -0.021734 0.148845
C  2.798694 1.348263 0.048889
C  -0.046548 3.504696 -0.505395
C  2.44705 -2.416555 0.108178
C  4.507909 -0.462138 0.291256
C  3.776808 -2.80628 0.243698
C  4.818115 -1.818021 0.339408
H  -3.21337 1.301229 -1.639098
H  -3.943879 1.400578 0.004448
H  -2.781771 0.120872 1.863327
H  -1.264068 -0.755751 1.503409
H  -5.217054 -0.200283 -1.361352
H  -3.718554 -1.088858 -1.816231
H  -2.510354 -2.384518 0.072129
H  -3.251338 -2.298998 1.712587
H  -4.909208 -3.212259 -0.744342
H  -6.280377 -2.121086 -0.334963
H  -5.441371 -3.017309 0.963848
H  -2.172368 3.046527 -0.594617
H  -0.043481 -1.358371 -0.175203
H  3.571324 2.124294 0.056906
H  -0.216798 4.57584 -0.674343
H  1.653115 -3.169999 0.03677
H  5.299845 0.293152 0.35691
H  4.039347 -3.869358 0.279106
H  5.859018 -2.142308 0.44744
