program: Gaussian 09
title: 000185515
version: EM64L-G09RevD.01
frameworkgroup: C1[X(C14H18N2O5)]
method: RPBEPBE
basis: SDD
operation: Freq
keyword: #p
keyword: freq=noraman
keyword: PBEPBE/SDD
title: #p freq=noraman PBEPBE/SDD
converged: YES YES NO NO
title: Mulliken charges:
elementType: O O O O O N N C C C C C C C C C C C C C C H H H H H H H H H H H H H H H H H H
charge: -0.283307 -0.404424 -0.414452 -0.229925 -0.224413 -0.367401 -0.656967 0.114564 -0.131140 -0.503285 0.242021 -0.614855 -0.711977 0.538581 0.166297 0.195704 -0.446158 -0.362472 -0.227256 -0.239686 -0.244677 0.290539 0.235216 0.257620 0.216834 0.256009 0.356640 0.211894 0.280604 0.203965 0.288632 0.291381 0.230216 0.233484 0.225180 0.228944 0.229277 0.386464 0.382329
chargesum: 0.00000
title: Mulliken charges with hydrogens summed into heavy atoms:
elementType: O O O O O N N C C C C C C C C C C C C C C
charge: -0.283307 -0.017960 -0.032123 -0.229925 -0.224413 -0.010761 -0.076954 0.114564 0.159399 -0.010449 0.242021 -0.142011 -0.015514 0.538581 0.166297 0.195704 -0.215942 -0.128988 -0.002076 -0.010743 -0.015400
polarizability: 1.71149782e+02 -2.12463804e+01 1.87289967e+02 6.22998458e+00 1.61372325e+00 1.61790557e+02
1716.lowfreq: -15.6790 -8.3380 -4.9188 -3.3472 -0.0009 -0.0006 0.0004 11.2975 18.3611
frequency: -15.2581 9.2021 18.0736 25.3803 36.4995 45.3748 63.2565 84.2437 87.0702 120.7757 139.6816 150.9757 207.6410 225.0497 236.5981 254.6049 269.8132 275.4098 324.1682 330.5895 345.0962 374.1049 401.8337 409.2950 422.2999 469.2202 476.4042 514.7503 534.7672 563.0518 576.0561 584.6420 591.7369 616.7150 626.5916 674.7633 684.5788 702.2520 725.1327 745.6657 753.9325 789.5529 796.8852 817.9060 851.2220 852.2125 870.2876 884.2372 910.2687 923.0125 931.4849 963.2431 974.7955 990.2779 995.1900 1018.1521 1028.3312 1040.7683 1053.4286 1080.1627 1089.6409 1115.0916 1149.1874 1159.7569 1172.3386 1184.0777 1191.4611 1214.8486 1217.1546 1236.9235 1269.7543 1273.2510 1301.8283 1308.9125 1313.8850 1328.0371 1337.7169 1344.5360 1383.5086 1391.4308 1440.7897 1448.6031 1460.5171 1465.9468 1474.8541 1482.6832 1487.0272 1593.9784 1613.5736 1616.7222 1641.1672 1653.5058 1667.8090 2986.2292 2990.9581 3005.7714 3013.0065 3051.9669 3075.9765 3090.2381 3114.8011 3121.5358 3124.5840 3133.1769 3145.6517 3163.3681 3413.5936 3423.8330 3514.0950 3514.8179 3544.8627
redmass: 4.0833 5.6669 5.1265 9.8247 8.0671 6.5563 5.0336 6.6739 5.7615 4.4576 4.4246 5.6666 1.6807 1.5221 3.5846 1.6010 3.1583 5.9745 4.2312 3.1049 2.7153 3.0058 2.8222 4.0115 2.5400 3.6030 3.1913 4.0267 4.3209 4.0188 2.0507 2.2591 1.9177 5.9213 2.1457 3.1588 3.3506 1.9029 2.5226 1.8687 1.8941 1.5452 3.3870 3.1847 1.6112 2.4039 1.9041 3.0704 2.4914 1.7970 2.0139 1.8171 1.3943 6.1759 1.3133 2.7111 2.1658 1.6642 1.6574 2.2715 1.7022 2.7787 1.8192 2.5556 1.0623 1.4318 1.1901 1.9132 1.8653 2.0745 1.6303 1.5628 1.3882 1.5700 1.9795 1.6016 1.4933 1.4044 6.9814 1.2031 2.1119 1.0912 1.1043 1.3055 1.0837 1.8439 2.0089 6.0048 7.2997 7.1991 1.1030 9.3259 8.3736 1.0378 1.0607 1.0602 1.0818 1.1016 1.1004 1.1015 1.0869 1.0868 1.0972 1.0912 1.0959 1.1015 1.0729 1.0498 1.0639 1.0640 1.0964
irintensity: 0.2197 0.2017 2.2576 0.7028 3.8494 1.3186 0.2905 1.6614 0.1275 3.9470 2.1986 0.6468 6.0376 0.9686 5.2976 11.6746 2.8259 17.9626 9.1494 7.0785 3.6014 2.2206 0.2428 0.9312 4.1108 9.3344 5.1148 21.0357 22.1193 47.9861 118.4336 13.1615 83.1321 2.4564 62.8032 73.7844 41.1642 49.1517 73.3980 62.9642 69.2433 72.0515 23.1730 57.1359 4.6296 6.7137 5.3868 16.3450 24.1108 7.1131 22.7702 1.0352 0.1188 0.0561 0.0974 3.6042 9.4648 109.6086 11.6511 211.7063 5.6089 27.4439 100.4928 22.4080 0.5665 14.8375 0.2667 5.4758 12.9834 35.4150 37.3809 10.6837 2.1958 5.6670 30.6419 15.9347 13.5698 8.3723 0.1726 22.1302 7.7630 10.7149 41.1021 109.2173 4.5783 155.9633 52.6001 0.7882 87.7808 96.7169 48.8958 264.5832 204.6025 24.0962 23.9209 15.1590 9.1569 11.4639 30.9269 8.0431 7.4046 3.9015 5.4115 13.5811 37.9423 20.6007 90.2574 14.6951 29.5373 31.3514 1.6234
temp: 298.150 k
press: 1.00000 atm
elementType: 8 8 8 8 8 7 7 6 6 6 6 6 6 6 6 6 6 6 6 6 6 1 1 1 1 1 1 1 1 1 1 1 1 1 1 1 1 1 1
symmnumber: 1
zpe: 807046.9 jmol-1
zpe.correction: 0.307388 hartree
zpe.thermalcorrener: 0.328142 hartree
zpe.thermalcorrenthalpy: 0.329086 hartree
zpe.thermalcorrgfe: 0.253967 hartree
zpe.sumelectzpe: -1028.366211 hartree
zpe.sumelectthermal: -1028.345457 hartree
zpe.sumelectthermalent: -1028.344513 hartree
zpe.sumelectthermalfe: -1028.419632 hartree
dipole: 0.2150 -3.3395 4.6125
dipole: 5.6986
quadrupole: -118.9394 -123.3408 -114.2191
quadrupole: -1.1214 -2.4442 3.3431
quadrupole: -0.1063 -4.5077 4.6140 -1.1214 -2.4442 3.3431
hfenergy: -1028.6735993 hartree
pointgroup: C01 [X(C14H18N2O5)]
dipole: -0.0529453 1.6733257 -1.4912095 debye
polarizability: 169.7702205|22.0681404|186.5867237|-2.1037244|5.3733614|163.8733615 unknown
InChI: InChI=1S/C14H18N2O5/c1-14(15,8-11(17)18)13(21)16-10(12(19)20)7-9-5-3-2-4-6-9/h2-6,10,16-17,19H,7-8,15H2,1H3
charge 0 multiplicity 1
39 atoms
O  -1.035014 0.067566 1.575754
O  -1.229643 -2.698329 -1.564096
O  -4.416317 1.095315 1.59242
O  0.235409 -4.018608 -0.337957
O  -4.091375 -1.039845 0.742318
N  -0.282278 -0.386971 -0.591911
N  -1.307695 1.808337 -1.639922
C  -1.858388 1.475246 -0.29031
C  0.482405 -1.567914 -0.23104
C  -3.301669 0.91061 -0.548577
C  -1.007976 0.324271 0.332366
C  1.952259 -1.522885 -0.763822
C  -1.866389 2.683781 0.674173
C  2.716141 -0.295016 -0.289851
C  -0.162375 -2.885016 -0.68292
C  -3.941754 0.194405 0.626874
C  3.261239 0.619851 -1.225487
C  2.911686 -0.046057 1.093573
C  3.988558 1.753953 -0.794872
C  3.635273 1.085237 1.528304
C  4.177939 1.990472 0.585572
H  0.496582 -1.603317 0.875755
H  -3.950675 1.756911 -0.843131
H  -3.24335 0.184085 -1.376803
H  1.934466 -1.551114 -1.870406
H  2.446771 -2.45235 -0.423989
H  -0.384823 -0.056931 -1.562747
H  -0.841753 3.085175 0.785321
H  -2.226871 2.388855 1.670742
H  -2.520726 3.482302 0.278947
H  -0.482562 2.419508 -1.578846
H  -2.009078 2.210947 -2.27322
H  3.122115 0.439305 -2.298985
H  2.494201 -0.735876 1.837207
H  4.408106 2.446543 -1.533623
H  3.775599 1.261454 2.600609
H  4.742032 2.866929 0.923743
H  -1.623684 -3.584157 -1.791717
H  -4.779686 0.578325 2.362054
