program: Gaussian 09
title: 000185559
version: EM64L-G09RevD.01
frameworkgroup: C1[X(C20H19NO5)]
method: RPBEPBE
basis: SDD
operation: Freq
keyword: #p
keyword: freq=noraman
keyword: PBEPBE/SDD
title: #p freq=noraman PBEPBE/SDD
converged: YES YES NO NO
title: Mulliken charges:
elementType: O O O O O N C C C C C C C C C C C C C C C C C C C C H H H H H H H H H H H H H H H H H H H
charge: -0.267026 -0.266295 -0.264924 -0.266213 -0.240235 -0.110685 -0.357101 -0.570798 -0.619988 0.374676 0.400992 0.456319 -0.678040 0.305540 0.120208 -0.588437 -0.576244 -0.578904 0.176785 0.176894 -0.498255 -0.650531 0.178111 0.168663 -0.204345 -0.205250 0.222678 0.211741 0.282462 0.213959 0.215925 0.274333 0.248445 0.228942 0.258558 0.258678 0.260948 0.264804 0.236295 0.250539 0.212013 0.231660 0.239695 0.240480 0.232930
chargesum: 0.00000
title: Mulliken charges with hydrogens summed into heavy atoms:
elementType: O O O O O N C C C C C C C C C C C C C C C C C C C C
charge: -0.267026 -0.266295 -0.264924 -0.266213 -0.240235 -0.110685 0.077318 -0.074377 -0.129731 0.374676 0.400992 0.456319 -0.200653 0.305540 0.120208 -0.329879 -0.317565 -0.317957 0.176785 0.176894 -0.233452 0.048316 0.178111 0.168663 0.267010 0.268160
polarizability: 3.65472640e+02 -7.02384910e+00 2.32824117e+02 8.63301944e+00 -1.57199990e+00 1.42825628e+02
1716.lowfreq: -12.3063 -6.2949 -0.0010 -0.0008 -0.0006 4.0220 30.5612 52.7521 70.4251
frequency: 30.5340 52.7356 70.4226 77.8176 88.6871 95.1441 106.0562 113.8524 159.8034 170.2000 181.4708 189.6108 215.0734 223.8399 234.3441 268.4432 275.6809 297.9940 307.2786 307.6282 339.3705 350.8465 358.6263 393.3769 412.6005 421.6881 430.3442 436.2247 452.8352 465.1189 494.3428 553.0910 566.1976 609.1459 642.7911 663.4949 670.6852 674.9847 682.1964 714.8815 719.2779 736.0142 749.1794 752.0189 774.0038 783.2448 816.5405 820.2632 833.4309 836.9289 861.0328 868.8562 871.9003 877.1376 908.7481 926.9081 940.9984 958.2733 971.9186 973.6689 982.6078 1006.5388 1023.5874 1037.0596 1048.2470 1071.8161 1073.1270 1110.3993 1127.4272 1128.1726 1132.7353 1156.8423 1160.3169 1163.6309 1167.2086 1186.9007 1200.1725 1222.9802 1234.8862 1246.3986 1254.4246 1269.1870 1279.2580 1292.4496 1321.1976 1331.2032 1356.3636 1359.2085 1361.5852 1371.4908 1399.3524 1406.4223 1412.4440 1420.0402 1430.5032 1438.7191 1455.5449 1464.1762 1466.5339 1469.1539 1472.9957 1475.4776 1486.2410 1486.7894 1488.9180 1558.7233 1612.4174 1616.4574 1623.5116 1625.0922 2884.5758 2901.7939 2920.7639 2963.9053 2993.4464 2994.6899 2996.6378 3011.7079 3019.3618 3033.6635 3035.0726 3080.0628 3092.9337 3110.0093 3110.3687 3155.2488 3159.8654 3161.3534 3168.6755
redmass: 5.7891 4.6179 5.0791 4.5482 4.2258 2.9371 2.5896 4.2965 3.6035 5.9023 6.2942 5.6263 1.2282 4.6642 5.7428 5.6378 5.0725 3.7926 3.3450 4.5210 2.8336 2.9224 5.1896 4.1047 3.5946 3.6402 2.8426 2.6698 3.6584 4.9382 5.0170 3.8695 4.3413 5.2602 6.3455 5.4095 8.2997 9.1132 8.0811 4.2517 5.0013 6.0840 3.9205 4.8598 4.2355 4.9446 4.2496 3.9414 8.0388 5.9280 1.4561 1.5017 1.4650 1.4761 2.4996 2.8928 2.4229 3.5614 4.4289 5.2268 2.1294 4.2814 2.0565 2.6898 3.2331 1.4970 1.4976 1.3207 1.0752 1.1055 1.9149 1.7994 2.7138 1.5540 1.7034 1.6048 1.8209 1.4228 1.6766 1.5800 2.9908 2.1184 2.2751 1.3551 2.1028 1.4176 1.4397 1.3387 1.2841 1.5079 5.5179 4.1482 4.3552 3.0956 1.2372 1.1530 1.1193 1.1541 1.1583 1.0770 1.7631 1.5069 1.3182 1.1884 1.7001 6.5109 8.4789 8.8038 9.6063 7.8582 1.0691 1.0534 1.0675 1.0613 1.0875 1.0619 1.0615 1.0627 1.0962 1.0882 1.0843 1.0993 1.1008 1.1096 1.1092 1.0921 1.0927 1.0927 1.0923
irintensity: 0.7367 0.5931 1.0253 2.9968 3.3870 13.2106 8.6062 3.3275 0.2195 3.1275 0.6687 5.1015 0.8201 0.9463 4.7179 2.7514 0.2181 3.5537 1.4784 6.1970 8.9492 5.7816 2.8021 2.7816 4.3849 9.9015 4.4341 3.9940 10.9602 2.5527 22.1416 13.0343 6.5858 10.1014 1.2616 9.7234 2.5682 0.2992 4.1236 3.1845 2.0081 3.2497 4.8684 3.6128 41.9712 13.0201 14.2277 11.6876 18.7243 37.7844 2.6503 4.1899 0.6030 65.6858 2.4902 10.3327 6.9495 52.5011 180.3203 71.4441 88.1088 6.1973 14.0562 4.6934 117.8181 8.8641 8.1427 9.1533 2.3425 2.0548 15.8925 30.0951 47.0545 9.3588 11.5156 35.5487 1.5008 3.6380 65.2761 105.7984 78.3305 89.4422 243.7289 9.7647 47.8344 18.1874 2.6183 3.3395 8.3862 22.8087 33.2448 5.5667 10.5746 9.3725 2.5982 30.0175 8.7755 36.5696 27.3615 18.9265 98.9901 111.2658 39.5788 18.3847 112.0985 109.8745 1.4667 13.6962 1.6135 2.7574 73.7950 99.3513 149.6560 23.6081 11.3442 153.8340 134.9701 49.9160 13.3138 7.2193 28.9181 5.5578 23.1793 29.3926 32.9742 6.2191 1.3307 6.0560 1.7044
temp: 298.150 k
press: 1.00000 atm
elementType: 8 8 8 8 8 7 6 6 6 6 6 6 6 6 6 6 6 6 6 6 6 6 6 6 6 6 1 1 1 1 1 1 1 1 1 1 1 1 1 1 1 1 1 1 1
symmnumber: 1
zpe: 921488.7 jmol-1
zpe.correction: 0.350977 hartree
zpe.thermalcorrener: 0.372742 hartree
zpe.thermalcorrenthalpy: 0.373686 hartree
zpe.thermalcorrgfe: 0.300987 hartree
zpe.sumelectzpe: -1202.450559 hartree
zpe.sumelectthermal: -1202.428793 hartree
zpe.sumelectthermalent: -1202.427849 hartree
zpe.sumelectthermalfe: -1202.500548 hartree
dipole: 0.7057 0.8661 2.5940
dipole: 2.8244
quadrupole: -131.7690 -140.9704 -157.8882
quadrupole: -1.4371 2.5248 1.9538
quadrupole: 11.7735 2.5722 -14.3457 -1.4371 2.5248 1.9538
hfenergy: -1202.8015351 hartree
pointgroup: C01 [X(C20H19N1O5)]
dipole: 0.2566727 -0.5412787 -0.9358918 debye
polarizability: 365.3533919|2.3750979|228.5367217|-12.7373521|-18.7604744|147.2322711 unknown
InChI: InChI=1S/C20H19NO5/c1-21-3-2-12-5-17-20(26-11-23-17)8-15(12)16(22)4-13-6-18-19(25-10-24-18)7-14(13)9-21/h5-8H,2-4,9-11H2,1H3
charge 0 multiplicity 1
45 atoms
O  -6.092944 -0.247582 -0.173838
O  -5.421453 2.035109 -0.484998
O  5.989504 0.029831 -0.527771
O  4.800639 2.033602 -1.100301
O  0.054051 0.015331 1.969981
N  -0.116648 -1.891795 -0.3706
C  0.908234 -2.848083 0.123619
C  -1.381809 -1.936822 0.395053
C  1.831884 -2.266866 1.239853
C  -2.35461 -0.79948 0.08519
C  2.597774 -1.061389 0.726218
C  -1.952875 0.55903 -0.107173
C  -0.493281 0.997917 -0.192656
C  1.896872 0.140992 0.404076
C  0.449321 0.297931 0.794061
C  -3.73965 -1.144608 0.078404
C  -2.940505 1.572369 -0.294991
C  3.988367 -1.172396 0.441696
C  -4.678616 -0.131313 -0.09898
C  -4.284864 1.207052 -0.282552
C  2.563954 1.23401 -0.227105
C  -0.290306 -1.92286 -1.838815
C  4.628656 -0.076403 -0.140917
C  3.928643 1.10018 -0.475492
C  -6.583773 1.156312 -0.186687
C  6.158085 1.450692 -0.938673
H  1.54312 -3.140978 -0.732613
H  0.424982 -3.776301 0.505456
H  -1.110317 -1.873004 1.467826
H  -1.905452 -2.91102 0.241484
H  2.532657 -3.067125 1.542258
H  1.22702 -1.99501 2.12083
H  -0.10777 0.848521 -1.219158
H  -0.443688 2.089693 0.003899
H  -4.055541 -2.183141 0.215332
H  -2.64616 2.615896 -0.439473
H  4.537625 -2.090357 0.669817
H  2.034607 2.154599 -0.486808
H  0.664977 -1.667539 -2.330008
H  -1.050213 -1.183156 -2.141419
H  -0.621311 -2.92083 -2.210894
H  -6.977882 1.409013 0.816415
H  -7.331701 1.26746 -0.986184
H  6.680662 1.483421 -1.906651
H  6.693238 1.994501 -0.136915
