program: Gaussian 09
title: 000185490
version: EM64L-G09RevD.01
frameworkgroup: C1[X(C10H10ClNO)]
method: RPBEPBE
basis: SDD
operation: Freq
keyword: #p
keyword: freq=noraman
keyword: PBEPBE/SDD
title: #p freq=noraman PBEPBE/SDD
converged: YES YES NO NO
title: Mulliken charges:
elementType: Cl O N C C C C C C C C C C H H H H H H H H H H
charge: -0.056786 -0.243246 -0.349703 -0.282109 -0.536215 -0.399555 0.510957 0.148297 -0.447366 -0.357171 -0.199057 -0.219968 -0.114404 0.230502 0.265038 0.252865 0.241520 0.230240 0.320170 0.236589 0.257277 0.256049 0.256075
chargesum: 0.00000
title: Mulliken charges with hydrogens summed into heavy atoms:
elementType: Cl O N C C C C C C C C C C
charge: -0.056786 -0.243246 -0.029533 -0.051607 -0.018311 0.072204 0.510957 0.148297 -0.210777 -0.099894 0.056992 0.036107 -0.114404
polarizability: 1.67305647e+02 6.34905463e-01 1.15157416e+02 1.60216414e+00 -2.76901533e+00 7.88999541e+01
1716.lowfreq: -16.1408 -5.6023 -2.3904 0.0014 0.0022 0.0030 18.3916 50.6906 73.6094
frequency: 13.8874 50.6611 73.6000 150.3361 169.0060 214.1862 246.8101 317.0715 365.6580 408.0654 408.4988 447.8448 494.8380 535.2172 604.2904 617.4410 623.6111 656.9881 723.8434 746.0158 756.5877 829.1304 834.4849 854.5989 900.7828 941.4950 950.8370 966.2878 998.7671 1001.9530 1029.5554 1074.0705 1081.8757 1109.9334 1143.6383 1177.8906 1187.2332 1203.5700 1223.0691 1255.9860 1273.7412 1291.9487 1321.4871 1329.3857 1380.7554 1394.3027 1407.4182 1448.9711 1477.6411 1498.2056 1585.8901 1600.0666 1666.2405 2968.3844 3015.7967 3042.4019 3050.6005 3095.2566 3128.5317 3140.5175 3169.2875 3172.3757 3572.1533
redmass: 4.2155 8.4911 4.9615 6.6158 4.0016 3.3392 4.7610 5.1790 4.6291 3.2378 3.9932 4.7704 1.7144 2.7210 3.1194 2.6944 3.5589 4.6948 3.3813 5.1489 4.3037 1.2811 1.5545 4.6386 2.1660 2.1896 1.4397 1.3721 3.5816 2.3957 2.0084 2.7076 2.7531 1.3771 1.2430 1.2492 1.1202 1.4241 1.4061 3.2678 1.4283 1.3769 1.8589 1.6398 5.2547 1.9673 2.1068 1.0866 2.3966 1.1055 7.1071 6.2477 8.2453 1.0658 1.0659 1.0862 1.0979 1.0987 1.0898 1.0893 1.0950 1.0961 1.0785
irintensity: 1.0099 4.2541 0.2962 0.2739 0.7000 1.6205 2.0050 1.0546 1.4862 1.9353 2.6009 15.7910 41.0310 17.5284 3.2067 72.4355 46.3251 19.5146 5.3048 6.8193 4.2277 9.5164 49.9139 3.0219 1.2225 3.8585 0.2753 0.1760 52.0128 2.2850 11.5014 33.8102 19.5871 10.8807 1.1043 5.3202 0.4787 4.0489 15.7104 100.4276 1.1813 4.1147 2.8090 6.0572 0.2614 16.9231 8.0674 12.0247 77.5108 17.6486 1.8159 5.6088 407.4581 66.3055 14.7107 18.7750 40.1937 9.2110 11.9820 4.8413 6.2685 0.3117 29.4082
temp: 298.150 k
press: 1.00000 atm
elementType: 17 8 7 6 6 6 6 6 6 6 6 6 6 1 1 1 1 1 1 1 1 1 1
symmnumber: 1
zpe: 469061.6 jmol-1
zpe.correction: 0.178656 hartree
zpe.thermalcorrener: 0.189991 hartree
zpe.thermalcorrenthalpy: 0.190935 hartree
zpe.thermalcorrgfe: 0.138930 hartree
zpe.sumelectzpe: -976.175643 hartree
zpe.sumelectthermal: -976.164308 hartree
zpe.sumelectthermalent: -976.163363 hartree
zpe.sumelectthermalfe: -976.215368 hartree
dipole: -0.1821 4.0149 1.8525
dipole: 4.4254
quadrupole: -100.8730 -80.9061 -80.6975
quadrupole: -10.8228 -8.5235 -4.6143
quadrupole: -13.3808 6.5861 6.7947 -10.8228 -8.5235 -4.6143
hfenergy: -976.3542988 hartree
pointgroup: C01 [X(C10H10Cl1N1O1)]
dipole: 0.1124495 -1.7016231 -0.3509993 debye
dipolederiv: -0.8342336 0.1034587 0.1851166 0.1200519 -0.1159757 -0.0598103 0.2054143 -0.058289 -0.1560615 -0.717468 -0.4047985 -0.0649419 -0.4459236 -1.017335 0.0346185 -0.2350415 -0.138679 -0.4670447 -0.5737394 -0.0775217 0.0347304 -0.1636409 -0.9550779 0.1145516 0.1963853 0.3712368 -0.5004024 0.1029399 -0.0238053 -0.0184535 -0.0297703 0.0951242 0.1002043 -0.1348388 0.0508248 0.1337225 -0.1204384 -0.0743232 -0.1756868 -0.0153276 -0.0061908 -0.0520017 -0.2428783 -0.0388165 -0.1944258 0.3108077 0.1668639 -0.0525068 0.072803 0.4375009 0.1148934 0.055001 0.2064863 0.1645393 0.3351499 -0.0177816 -0.0354444 -0.0884628 -0.0835854 -0.0050717 -0.0784442 -0.0074497 -0.0773875 0.6739612 0.4509376 0.2451016 0.6657962 1.485856 -0.2296974 0.3211046 -0.3162534 0.6988082 -0.0764861 -0.002451 -0.0156754 0.0277578 -0.0406869 0.1178384 0.0134821 0.1225271 -0.0135201 -0.0367465 0.0363184 0.020941 0.0661315 -0.0557496 0.0799919 0.0495661 0.0762924 -0.0447821 -0.2369892 0.0821279 0.1058809 0.1019056 -0.0732352 0.0172326 0.1224364 0.0200827 -0.084348 -0.3180514 0.0227834 0.044 0.0014063 -0.0415188 0.0663303 0.0251083 0.0620516 -0.0387863 1.1646541 -0.1652279 -0.3000908 -0.1760524 0.0322316 0.1363024 -0.3119578 0.1335748 0.1038243 0.0137403 -0.0350919 -0.040923 -0.0104915 -0.0264647 -0.1110625 0.0077285 -0.0991493 -0.0585262 0.04969 0.0699656 -0.0473319 0.0808299 -0.0243057 0.0319592 -0.0394846 0.0035521 0.0922545 -0.0526657 -0.0157643 0.1004114 -0.0178251 0.0810853 -0.0370512 0.0876362 -0.0017624 -0.0174936 0.0259441 -0.1140626 0.0810998 -0.1002971 -0.0122313 0.0269783 0.0952638 0.0591657 -0.0319806 -0.1181867 0.109715 0.0357746 0.0840797 -0.1397872 -0.0553166 -0.0061823 -0.1322214 0.0403516 0.2648347 -0.059467 -0.0918021 -0.0924774 0.1575569 0.0296092 -0.1021609 0.0081261 0.2045281 0.0597073 0.0462475 0.0610643 0.0294045 0.0446305 -0.1138425 0.0444217 -0.1157854 0.010699 0.0054576 -0.0600129 -0.0520824 -0.0767377 0.078765 -0.048091 -0.061537 -0.0481548 0.0849469 -0.0016114 -0.0579241 -0.0491899 -0.0542869 0.1044541 -0.0615158 -0.0443618 -0.0616749 0.0992435 0.0797296 0.0198141 0.0300084 0.0211271 0.0749397 -0.0970495 0.0333391 -0.0956844 0.0518409 unknown
polarizability: 166.5121597|5.2820107|100.1337463|-6.6971138|17.7339811|94.717111 unknown
InChI: InChI=1S/C10H10ClNO/c11-9-3-1-7(2-4-9)8-5-10(13)12-6-8/h1-4,8,12H,5-6H2
charge 0 multiplicity 1
23 atoms
Cl -4.727677 0.429515 0.923993
O  3.452396 1.972767 0.412966
N  2.732558 -0.213925 0.934805
C  1.115215 -0.631871 -0.779824
C  1.930206 0.6605 -1.097019
C  1.953632 -1.322062 0.362407
C  -0.325107 -0.352563 -0.356151
C  2.796429 0.929349 0.147724
C  -1.398924 -1.019617 -0.997378
C  -0.627689 0.564394 0.686529
C  -2.741407 -0.790034 -0.617648
C  -1.961218 0.806639 1.081352
C  -3.000509 0.122302 0.421142
H  1.091147 -1.300062 -1.657679
H  1.295382 1.534164 -1.313877
H  2.606059 0.519016 -1.960681
H  1.299112 -1.791347 1.117765
H  2.617412 -2.104998 -0.057021
H  3.275125 -0.293399 1.795486
H  -1.191114 -1.728273 -1.808166
H  0.179976 1.098693 1.199205
H  -3.563735 -1.307362 -1.120118
H  -2.187272 1.514976 1.883687
