program: Gaussian 09
title: 000185484
version: EM64L-G09RevD.01
frameworkgroup: C1[X(C15H10ClNO2)]
method: RPBEPBE
basis: SDD
operation: Freq
keyword: #p
keyword: freq=noraman
keyword: PBEPBE/SDD
title: #p freq=noraman PBEPBE/SDD
converged: YES YES NO NO
title: Mulliken charges:
elementType: Cl O O N C C C C C C C C C C C C C C C H H H H H H H H H H
charge: -0.061180 -0.195917 -0.209519 -0.360464 0.382946 -0.613834 0.073038 0.125107 0.064313 0.532636 -0.346925 -0.325729 -0.228322 -0.234553 -0.300510 -0.346675 -0.078076 -0.196537 -0.242774 0.274318 0.271868 0.240693 0.279890 0.237098 0.240251 0.272851 0.252557 0.234979 0.258469
chargesum: 0.00000
title: Mulliken charges with hydrogens summed into heavy atoms:
elementType: Cl O O N C C C C C C C C C C C C C C C
charge: -0.061180 -0.195917 -0.209519 -0.360464 0.382946 -0.067648 0.073038 0.125107 0.064313 0.532636 -0.106232 -0.045839 0.008776 0.005697 -0.027659 -0.094118 -0.078076 0.038442 0.015695
polarizability: 2.63855030e+02 2.17491287e+00 1.66357416e+02 -4.63671830e+00 -3.86608126e+00 1.13612081e+02
1716.lowfreq: -2.3694 -0.0007 -0.0003 0.0018 6.1805 8.1560 20.0754 27.1441 44.4117
frequency: 20.0294 27.0009 44.3958 71.3401 112.5610 128.0213 181.0453 205.3081 214.6543 251.5695 278.0526 296.0270 375.7653 381.1519 409.2727 425.2220 439.9907 450.4846 462.7890 517.8694 535.5586 545.9541 589.3394 626.9596 650.5855 659.1649 684.9685 690.4575 722.4055 737.1988 783.9985 795.4024 849.5993 867.7355 881.8371 884.3503 904.8439 944.9585 973.5016 978.3124 981.7197 987.5534 1007.7328 1037.0091 1071.3618 1091.1715 1097.8553 1120.7247 1174.6639 1175.7888 1189.2815 1203.7660 1211.5200 1235.8233 1255.1454 1285.1352 1320.0912 1329.3965 1381.1355 1397.1193 1420.4127 1421.2632 1447.7876 1463.5239 1484.2044 1575.2269 1587.8598 1604.0151 1605.6763 1613.7275 1633.3328 2983.7978 3039.2635 3126.1730 3143.5053 3148.4902 3157.5432 3170.8100 3172.9118 3180.1240 3183.3168
redmass: 5.9973 7.1910 4.6485 5.6581 10.3698 3.9561 5.6902 4.0761 4.9269 5.1680 7.2462 6.0923 10.6116 8.3438 3.9988 9.0465 3.1948 4.4515 3.1335 6.4047 8.1815 5.7435 4.2132 5.6468 6.6526 6.3873 2.5708 4.1027 6.0949 2.0442 1.4535 1.9338 4.5568 3.3766 1.8405 1.3840 1.4196 2.2968 1.7818 2.9051 1.4380 5.8544 1.3412 2.1970 2.0488 1.7132 2.7375 2.4616 1.1003 1.0799 2.1131 1.3567 2.2132 2.7835 1.9152 1.3492 4.3450 1.8157 10.5532 7.3714 1.4266 1.8026 2.5572 2.5121 2.5796 8.9424 7.3304 7.2042 8.2280 7.6191 9.9892 1.0645 1.0938 1.0878 1.0898 1.0875 1.0939 1.0932 1.0999 1.0968 1.0963
irintensity: 0.1823 0.0516 5.8211 2.4288 1.3786 3.9395 0.0098 2.0920 3.2711 4.8524 2.6974 4.5643 17.6294 4.0531 4.2816 2.1807 4.1999 2.8770 2.7531 22.6093 3.4659 5.3142 3.3423 5.2003 2.0631 16.3583 33.7062 7.5720 50.9694 47.2038 45.5834 23.3422 3.7714 15.3723 0.3410 3.4779 4.1731 6.9788 4.2054 18.0867 5.6232 1.7854 0.1476 10.0108 19.9269 13.6354 2.2276 101.9633 11.5089 1.0556 86.6443 25.2096 2.0395 178.2755 27.5343 10.6093 267.5561 9.6430 0.8406 1.5625 10.4056 25.5265 38.5595 51.8702 2.3923 153.7438 46.2267 6.6521 129.3883 167.3649 67.2692 3.0715 1.1327 4.1747 10.8009 7.1099 9.6175 4.8223 22.4076 3.8035 2.8154
temp: 298.150 k
press: 1.00000 atm
elementType: 17 8 8 7 6 6 6 6 6 6 6 6 6 6 6 6 6 6 6 1 1 1 1 1 1 1 1 1 1
symmnumber: 1
zpe: 552176.1 jmol-1
zpe.correction: 0.210313 hartree
zpe.thermalcorrener: 0.225696 hartree
zpe.thermalcorrenthalpy: 0.226640 hartree
zpe.thermalcorrgfe: 0.165248 hartree
zpe.sumelectzpe: -1241.580746 hartree
zpe.sumelectthermal: -1241.565362 hartree
zpe.sumelectthermalent: -1241.564418 hartree
zpe.sumelectthermalfe: -1241.625811 hartree
dipole: 4.9384 -0.1651 1.0298
dipole: 5.0473
quadrupole: -96.8993 -119.1447 -115.0199
quadrupole: 11.7979 -5.6245 -5.6055
quadrupole: 13.4553 -8.7901 -4.6653 11.7979 -5.6245 -5.6055
hfenergy: -1241.7910586 hartree
pointgroup: C01 [X(C15H10Cl1N1O2)]
dipole: -1.8998306 -0.0079478 -0.5777849 debye
polarizability: 263.461441|-3.7874277|165.512302|8.424371|7.6399894|114.8507842 unknown
InChI: InChI=1S/C15H10ClNO2/c16-11-5-3-6-12(9-11)17-14(18)8-10-4-1-2-7-13(10)15(17)19/h1-7,9H,8H2
charge 0 multiplicity 1
29 atoms
Cl 4.951399 0.608156 2.104656
O  0.823339 2.370692 -0.58504
O  -0.364067 -2.073837 0.281162
N  0.231057 0.146194 -0.16804
C  -2.5746 0.856851 -0.128917
C  -1.552545 1.903158 -0.508499
C  -2.170687 -0.474532 0.139599
C  -0.082286 1.514611 -0.416455
C  -0.739498 -0.885847 0.090312
C  1.639954 -0.238042 -0.152954
C  -3.948986 1.18675 -0.054218
C  -3.133447 -1.463415 0.474941
C  -4.905012 0.205361 0.28122
C  -4.49667 -1.126207 0.546265
C  2.488961 0.300122 0.838134
C  2.131491 -1.137635 -1.122426
C  3.841316 -0.083261 0.832974
C  3.49319 -1.507092 -1.09616
C  4.365785 -0.980965 -0.116286
H  -1.713259 2.232688 -1.5554
H  -1.673752 2.818108 0.101062
H  -4.269743 2.215183 -0.258806
H  -2.780805 -2.480149 0.674734
H  -5.965429 0.474536 0.33711
H  -5.239179 -1.887321 0.806865
H  2.106953 1.00453 1.580681
H  1.45593 -1.553261 -1.874894
H  3.881901 -2.20935 -1.840437
H  5.422588 -1.261124 -0.091985
