program: Gaussian 09
title: 000185537
version: EM64L-G09RevD.01
frameworkgroup: C1[X(C21H25N3O3)]
method: RPBEPBE
basis: SDD
operation: Freq
keyword: #p
keyword: freq=noraman
keyword: PBEPBE/SDD
title: #p freq=noraman PBEPBE/SDD
converged: NO YES NO NO
title: Mulliken charges:
elementType: O O O N N N C C C C C C C C C C C C C C C C C C C C C H H H H H H H H H H H H H H H H H H H H H H H H H
charge: -0.425771 -0.282395 -0.257445 -0.224345 -0.425982 -0.162114 0.249363 -0.010004 -0.153015 -0.592587 0.251969 0.209596 -0.187147 0.224466 0.217511 0.177300 -0.835289 -0.754355 -0.487348 -0.366776 -0.035916 -0.454212 -0.411150 -0.386792 -0.267243 -0.208689 -0.637215 0.271053 0.288338 0.247958 0.322602 0.270997 0.221051 0.231195 0.269422 0.236879 0.227720 0.226242 0.220503 0.275726 0.355176 0.263363 0.225339 0.228283 0.237419 0.233224 0.249378 0.242563 0.228248 0.225383 0.209514 0.228008
chargesum: 0.00000
title: Mulliken charges with hydrogens summed into heavy atoms:
elementType: O O O N N N C C C C C C C C C C C C C C C C C C C C C
charge: -0.070595 -0.282395 -0.257445 -0.224345 -0.103380 -0.162114 0.249363 -0.010004 0.118039 -0.056291 0.251969 0.209596 0.083850 0.224466 0.217511 0.177300 -0.113620 -0.063515 0.008881 0.121927 0.192368 0.016432 -0.161773 -0.144230 -0.038995 0.016694 -0.199693
polarizability: 2.84223643e+02 -3.10931454e+01 2.11465815e+02 2.97082471e+00 2.02501081e+00 2.30535146e+02
1716.lowfreq: -6.3273 -2.7613 -0.0005 0.0004 0.0006 12.8193 35.5444 40.9233 60.0856
frequency: 35.3862 40.8883 60.0193 64.2525 93.9942 109.6460 115.2115 122.1726 133.9877 162.4464 169.4534 195.2865 223.6596 237.1389 240.5303 260.0822 262.1347 281.4395 286.4852 296.3635 301.4760 312.4485 321.2112 339.5451 348.4057 361.6386 370.7992 383.5736 398.1772 431.1534 455.2572 473.1397 476.4031 504.6437 524.2965 539.0362 554.1913 568.5534 581.6061 589.4522 602.2881 632.3837 635.6495 676.9266 703.9779 705.9430 720.5588 750.5109 755.1911 759.9188 774.6439 793.4597 821.9077 844.5750 854.8686 864.8124 870.3095 898.4359 916.1429 921.7919 928.5651 938.9131 942.8458 944.7156 964.6419 974.3989 986.0110 995.6146 1001.5449 1011.8738 1018.0905 1019.7099 1028.5225 1049.1444 1058.3687 1076.1034 1085.1923 1087.4148 1114.0021 1123.2405 1133.7375 1154.8822 1162.7539 1167.4541 1169.4968 1171.1676 1175.5959 1195.9853 1209.5371 1233.1734 1249.6482 1259.1916 1267.8247 1274.2422 1281.5496 1284.6651 1294.4310 1302.2060 1311.5653 1314.9427 1318.0038 1330.1595 1332.1432 1352.0943 1370.7813 1372.7978 1386.3677 1388.9072 1417.4838 1420.9027 1459.3337 1462.3488 1468.0842 1473.6957 1477.3523 1479.9193 1487.3849 1491.1953 1493.1911 1505.8015 1593.1926 1602.9037 1620.2765 1623.4551 1647.9450 2939.8779 2947.9538 2987.5546 2989.1658 2995.6178 3015.1919 3023.1494 3056.0440 3076.4965 3077.4213 3087.0488 3088.5809 3090.7379 3099.7566 3104.8536 3106.6881 3110.3420 3117.7083 3126.2816 3132.8529 3149.5649 3166.2140 3197.7984 3478.3205 3550.6209
redmass: 4.6584 4.6056 3.6933 4.2241 3.1865 3.6431 4.1235 4.4225 4.7186 4.7264 3.9258 1.3446 3.5448 2.9102 3.1862 3.3738 3.3830 4.1092 3.0843 1.9092 2.3456 2.2056 3.8738 1.9275 3.5231 4.3783 1.6235 2.6171 1.8837 2.6996 4.5100 4.0232 3.4802 5.0067 3.6013 3.5478 3.7221 4.4788 2.3181 3.1542 3.5907 4.2985 3.1379 2.7725 4.2653 2.6267 4.1308 2.7317 2.0572 2.5434 3.8043 3.3560 2.4172 3.7185 1.5245 2.5614 2.2150 2.5445 2.3612 1.7124 1.4261 1.3945 1.9492 2.0338 3.2175 1.3073 2.4989 1.2875 1.5050 2.0516 2.3170 2.4911 3.5307 1.6004 2.2543 2.6004 1.8531 2.2660 2.9716 2.1702 2.4174 1.7230 1.6265 2.2428 3.3854 1.2339 1.6650 2.5479 1.7896 1.3683 2.8717 1.4521 1.3326 1.4816 1.7407 1.6715 1.3242 1.3765 1.7711 1.3489 1.5758 1.7885 1.5042 3.9731 1.1934 2.4138 4.1935 1.3248 2.5849 1.2068 2.1054 1.1883 1.0866 1.1294 1.1023 2.3907 1.0672 1.0679 1.0861 1.0555 9.9097 6.6133 9.8594 7.9568 4.5823 1.0828 1.0828 1.0670 1.0366 1.0355 1.0629 1.0637 1.0612 1.0988 1.0971 1.1014 1.0951 1.0697 1.1047 1.0899 1.0948 1.0989 1.1033 1.0858 1.0898 1.0942 1.0999 1.1140 1.0770 1.0660
irintensity: 0.4051 0.3799 0.3145 1.4380 1.0747 0.4980 2.2679 0.7914 3.7847 0.6673 1.8875 0.9416 3.4279 6.1288 4.6221 3.2841 0.5293 0.4156 1.7574 10.0402 2.4903 6.6998 3.6074 7.5392 23.9883 3.5267 55.8028 21.9482 22.6280 5.7732 5.6307 22.7864 14.5523 0.7716 13.2378 32.1777 16.1679 4.0967 1.4241 9.7488 50.1500 37.8486 29.2688 21.5601 5.8835 27.4048 10.2372 14.4666 64.6664 23.7936 6.9458 14.9475 6.1971 5.1115 2.0313 10.5977 1.7760 12.4958 9.4112 12.9308 72.3558 2.7816 22.8851 6.2973 32.2157 0.3210 18.0537 1.0953 11.9414 11.8559 82.5224 21.8458 17.8880 2.6716 4.5448 24.8724 24.9404 64.5427 18.0516 12.8452 39.4131 9.6272 6.1055 0.6381 3.1620 5.7472 9.8086 13.4461 0.8751 36.9253 20.7887 0.4663 12.4714 10.0313 4.6057 15.4904 11.6786 1.3181 22.9645 2.9589 34.1687 92.1809 4.9478 224.5387 20.6004 74.7002 39.0866 24.2323 22.0954 12.0395 78.9805 5.1363 9.4233 35.6363 31.9312 44.1890 1.7251 1.3309 7.7245 26.5743 154.3132 6.4336 240.6381 191.8459 16.9466 27.8912 12.4948 49.0592 21.3004 27.2808 21.9910 34.8108 8.5231 30.3233 11.9837 25.4075 18.4343 22.2485 28.0980 5.2988 2.8142 22.9067 4.8878 1.9160 8.5971 19.5795 27.3772 17.2635 73.6095 10.5358
temp: 298.150 k
press: 1.00000 atm
elementType: 8 8 8 7 7 7 6 6 6 6 6 6 6 6 6 6 6 6 6 6 6 6 6 6 6 6 6 1 1 1 1 1 1 1 1 1 1 1 1 1 1 1 1 1 1 1 1 1 1 1 1 1
symmnumber: 1
zpe: 1118415.1 jmol-1
zpe.correction: 0.425982 hartree
zpe.thermalcorrener: 0.449872 hartree
zpe.thermalcorrenthalpy: 0.450816 hartree
zpe.thermalcorrgfe: 0.374877 hartree
zpe.sumelectzpe: -1203.182073 hartree
zpe.sumelectthermal: -1203.158183 hartree
zpe.sumelectthermalent: -1203.157238 hartree
zpe.sumelectthermalfe: -1203.233178 hartree
dipole: 0.0744 -1.7100 -2.4491
dipole: 2.9879
quadrupole: -142.9686 -154.1191 -174.1074
quadrupole: 0.2809 6.2337 2.3363
quadrupole: 14.0965 2.9459 -17.0424 0.2809 6.2337 2.3363
hfenergy: -1203.6080548 hartree
pointgroup: C01 [X(C21H25N3O3)]
dipole: 0.0352996 0.3221202 1.1299907 debye
polarizability: 283.4135758|31.4099077|213.1946251|6.8767155|-4.4780218|229.6164031 unknown
InChI: InChI=1S/C21H25N3O3/c1-4-19(2,3)21-20(27,13-8-5-6-9-14(13)22-21)12-16-17(25)23-11-7-10-15(23)18(26)24(16)21/h4-6,8-9,15-16,22,27H,1,7,10-12H2,2-3H3
charge 0 multiplicity 1
52 atoms
O  2.227264 -0.570015 -2.34755
O  -1.038957 -0.74138 2.212129
O  -2.333802 1.727347 -2.396081
N  -0.446449 0.102325 0.094591
N  1.542044 -1.033395 0.93929
N  -2.799415 1.463615 -0.11137
C  0.676118 -0.850646 -0.244699
C  1.543586 0.091656 -1.229535
C  -0.494323 1.334538 -0.757709
C  0.534357 1.077994 -1.860137
C  0.125818 -2.224141 -0.826769
C  2.551413 0.692502 -0.254566
C  -2.29152 1.173964 1.262842
C  -1.204303 0.066073 1.242955
C  2.503423 -0.006719 0.983143
C  -1.956713 1.551186 -1.199536
C  -0.582707 -2.002201 -2.184086
C  1.304767 -3.228593 -1.027202
C  -3.560636 0.782398 2.065349
C  -4.273307 1.337683 -0.198524
C  -0.813044 -2.87246 0.197374
C  -4.599386 0.38851 0.979249
C  3.483102 1.722999 -0.464864
C  3.375473 0.337711 2.040605
C  4.365632 2.076251 0.587393
C  4.301751 1.38585 1.824594
C  -2.106155 -3.228775 0.000509
H  -0.181958 2.205364 -0.141236
H  0.05775 0.624709 -2.742773
H  1.030814 2.00602 -2.183001
H  1.063685 -1.333859 1.796488
H  -1.815992 2.080621 1.695335
H  -0.991646 -2.962871 -2.544746
H  -1.421284 -1.286573 -2.109202
H  0.134573 -1.638736 -2.936265
H  1.905675 -3.329153 -0.107409
H  1.960726 -2.907375 -1.852499
H  0.890814 -4.219784 -1.285028
H  -3.92024 1.648449 2.648628
H  -3.325193 -0.036578 2.763982
H  3.086338 -0.933939 -2.012175
H  -4.547576 0.948518 -1.19312
H  -4.756254 2.32617 -0.069497
H  -0.35328 -3.104524 1.169056
H  -4.44385 -0.660882 0.668952
H  -5.638585 0.496025 1.331686
H  3.524356 2.247511 -1.426755
H  3.341069 -0.190497 2.999255
H  5.093662 2.881815 0.44762
H  4.985556 1.667584 2.6337
H  -2.674668 -3.731653 0.790892
H  -2.635617 -3.037439 -0.939287
