program: Gaussian 09
title: 000185473
version: EM64L-G09RevD.01
frameworkgroup: C1[X(C14H23O2P)]
method: RPBEPBE
basis: SDD
operation: Freq
keyword: #p
keyword: freq=noraman
keyword: PBEPBE/SDD
title: #p freq=noraman PBEPBE/SDD
converged: YES YES NO NO
title: Mulliken charges:
elementType: P O O C C C C C C C C C C C C C C H H H H H H H H H H H H H H H H H H H H H H H
charge: 1.122080 -0.526102 -0.654605 -0.709320 -0.013470 -0.153994 -0.279917 -0.041627 -0.690612 -0.691473 -0.693462 -0.696600 -0.273459 -0.299822 -0.217375 -0.208374 -0.225615 0.253538 0.267411 0.219683 0.207464 0.232885 0.206547 0.269616 0.198620 0.206415 0.219420 0.212681 0.209353 0.206439 0.213529 0.240927 0.218714 0.210663 0.211167 0.261243 0.285869 0.233907 0.234998 0.232659
chargesum: 0.00000
title: Mulliken charges with hydrogens summed into heavy atoms:
elementType: P O O C C C C C C C C C C C C C C
charge: 1.122080 -0.526102 -0.654605 -0.188372 0.206214 -0.153994 0.160432 0.164920 -0.015961 -0.050019 -0.032568 -0.056057 -0.012216 -0.013953 0.016532 0.026624 0.007044
polarizability: 1.75245119e+02 -7.27210024e+00 1.98900675e+02 -3.73132367e+00 -1.95754009e-01 1.60600669e+02
1716.lowfreq: -6.8458 -4.5029 0.0008 0.0011 0.0020 5.9026 21.7567 27.3650 31.1380
frequency: 21.0411 26.4778 31.1068 37.0239 43.2690 47.5225 94.3686 115.7065 134.6017 180.6235 191.8417 198.9292 209.3179 220.6350 223.7705 231.4235 243.0222 257.1837 282.2805 321.1483 344.4597 375.0127 396.9227 398.9767 410.2104 430.8745 448.0063 455.4794 510.2195 610.8873 645.0919 680.4733 704.3802 724.9950 764.9820 809.1079 813.3903 844.5533 865.4839 894.7119 916.4764 921.7214 936.8845 938.4015 953.2293 960.7212 964.4292 969.4860 985.2530 987.3303 992.8573 1006.2147 1021.0576 1070.9058 1084.3647 1099.5913 1119.4301 1131.6136 1159.0335 1174.0355 1180.1309 1181.8869 1188.2869 1211.3380 1245.4898 1254.2646 1291.2274 1310.9977 1320.3502 1338.4576 1344.8188 1361.6097 1376.4788 1379.1130 1380.1923 1396.0505 1398.1216 1417.1516 1426.8008 1457.2038 1466.3613 1467.6202 1469.4460 1469.9075 1470.7457 1480.3488 1480.4635 1491.9325 1492.5802 1588.0890 1597.0190 2964.8436 2969.0584 2969.1934 2971.9395 2972.5306 2976.9190 2986.3351 3005.8501 3048.4084 3062.4515 3062.7152 3067.6708 3070.4396 3073.2650 3075.9257 3077.5544 3082.1263 3084.2022 3127.4377 3134.1360 3142.9122 3153.6876 3166.9354
redmass: 3.1160 2.8395 3.7057 3.8028 3.1277 2.9222 3.5087 4.6653 3.7007 2.4245 1.7506 2.2215 1.0655 2.2909 2.5135 1.3153 1.6837 4.5524 2.1653 4.8308 2.5835 2.4473 2.7729 2.1098 1.9023 3.1225 6.8997 3.7606 3.9874 6.4508 7.3575 6.0330 1.9796 4.0519 1.7211 2.6524 2.6307 1.6298 1.2466 1.6504 1.2077 1.1724 1.6927 1.3827 1.6784 2.0594 1.6523 2.3266 6.0365 1.4465 5.4619 1.3291 2.8691 1.5000 1.7090 2.4458 2.1354 2.2752 1.8078 1.0559 1.7955 1.7961 1.1296 1.4328 1.2918 1.1873 1.3650 1.3187 1.4845 1.3457 1.4262 1.2770 1.2095 1.2505 6.4777 1.2106 1.1943 1.0900 2.1152 1.0703 2.0351 1.0464 1.0539 1.0493 1.0630 1.0477 1.0532 1.0514 1.0507 6.1009 5.8411 1.0825 1.0406 1.0357 1.0410 1.0510 1.0383 1.0793 1.0580 1.1060 1.0994 1.0999 1.1003 1.0999 1.0995 1.0989 1.1021 1.1007 1.0983 1.0850 1.0879 1.0926 1.0967 1.1017
irintensity: 0.2330 0.3734 0.3058 0.4444 0.3660 0.2530 0.5952 1.0006 2.6725 6.6312 0.2496 10.5277 0.5685 3.3756 0.3975 3.0316 0.8477 15.3241 1.0462 0.3565 1.5890 5.5010 0.4856 7.0497 1.8334 13.5985 32.9946 12.6128 49.2621 1.4776 93.1268 54.4012 66.3948 52.8890 18.7714 7.5790 20.5836 7.8155 0.1792 27.0431 2.8439 5.4483 49.6795 0.3137 0.3412 98.0885 0.5293 149.9032 18.3299 1.1855 38.8947 0.2206 1.5716 8.5861 1.6175 64.4755 7.3073 2.8035 0.2037 0.0968 17.8556 0.7962 1.8965 4.7474 6.1146 0.5981 0.8016 3.2519 2.6962 3.3986 0.3545 4.6397 15.7862 17.0683 1.8064 12.5067 23.8070 9.7177 19.2067 1.0940 5.6449 3.0671 3.3089 15.0022 8.8268 6.7275 13.0574 17.2502 18.8128 0.1178 0.2737 9.9412 10.5805 27.3515 50.4707 67.7316 14.7417 24.9630 9.0964 13.6579 7.5326 34.5532 36.4189 30.4363 44.9716 64.2488 33.0968 20.1416 34.8735 0.0139 3.3645 4.7287 20.4678 29.6722
temp: 298.150 k
press: 1.00000 atm
elementType: 15 8 8 6 6 6 6 6 6 6 6 6 6 6 6 6 6 1 1 1 1 1 1 1 1 1 1 1 1 1 1 1 1 1 1 1 1 1 1 1
symmnumber: 1
zpe: 890102.8 jmol-1
zpe.correction: 0.339022 hartree
zpe.thermalcorrener: 0.359514 hartree
zpe.thermalcorrenthalpy: 0.360458 hartree
zpe.thermalcorrgfe: 0.287390 hartree
zpe.sumelectzpe: -1037.626374 hartree
zpe.sumelectthermal: -1037.605882 hartree
zpe.sumelectthermalent: -1037.604938 hartree
zpe.sumelectthermalfe: -1037.678006 hartree
dipole: -1.0143 1.8518 -2.3796
dipole: 3.1813
quadrupole: -106.6542 -102.4374 -114.5853
quadrupole: -1.9649 -0.4114 3.8274
quadrupole: 1.2381 5.4549 -6.6930 -1.9649 -0.4114 3.8274
hfenergy: -1037.9653963 hartree
pointgroup: C01 [X(C14H23O2P1)]
dipole: 0.7256215 -0.3263591 -0.9661609 debye
polarizability: 189.7835082|-13.6952656|184.1590352|1.7795605|3.6680464|160.8039195 unknown
InChI: InChI=1S/C14H23O2P/c1-12(2)10-16-17(15,11-13(3)4)14-8-6-5-7-9-14/h5-9,12-13H,10-11H2,1-4H3
charge 0 multiplicity 1
40 atoms
P  -0.513101 0.8949 0.200724
O  -1.826473 0.471339 -0.89559
O  -0.954273 1.070829 1.738095
C  0.153221 2.418946 -0.670656
C  1.42797 3.011462 -0.015822
C  0.727642 -0.475305 -0.03286
C  -3.174126 0.209373 -0.323431
C  -3.572903 -1.272424 -0.460125
C  1.105298 3.690874 1.33726
C  2.095522 4.009856 -0.992943
C  -2.67336 -2.190212 0.396538
C  -5.064661 -1.42581 -0.072767
C  1.007344 -1.001345 -1.316207
C  1.381903 -0.98173 1.114178
C  1.95963 -2.036509 -1.451044
C  2.332908 -2.017764 0.972729
C  2.624669 -2.541622 -0.30831
H  0.341551 2.10814 -1.71537
H  -0.669512 3.15766 -0.678929
H  2.146581 2.18473 0.166891
H  -3.862699 0.851959 -0.902917
H  -3.188162 0.523286 0.740677
H  -3.453847 -1.552273 -1.526793
H  0.577877 3.002722 2.021528
H  0.45454 4.572503 1.177672
H  2.032873 4.038968 1.827461
H  3.002519 4.449427 -0.538594
H  2.38967 3.51994 -1.939947
H  1.405034 4.840088 -1.236077
H  -2.977308 -3.24801 0.28998
H  -2.74269 -1.918143 1.467111
H  -1.614588 -2.109678 0.093801
H  -5.390588 -2.475169 -0.190078
H  -5.718848 -0.794142 -0.703169
H  -5.228486 -1.139814 0.984125
H  0.469959 -0.627106 -2.194838
H  1.128081 -0.573423 2.099232
H  2.17783 -2.451759 -2.441048
H  2.841387 -2.415934 1.857546
H  3.361821 -3.345329 -0.415936
