program: Gaussian 09
title: 000185454
version: EM64L-G09RevD.01
frameworkgroup: C1[X(C19H31NO3)]
method: RPBEPBE
basis: SDD
operation: Freq
keyword: #p
keyword: freq=noraman
keyword: PBEPBE/SDD
title: #p freq=noraman PBEPBE/SDD
converged: YES YES NO NO
title: Mulliken charges:
elementType: O O O N C C C C C C C C C C C C C C C C C C C H H H H H H H H H H H H H H H H H H H H H H H H H H H H H H H
charge: -0.281185 -0.287094 -0.468241 -0.407003 -0.164427 -0.506821 -0.474020 -0.256551 -0.233575 0.267130 -0.569068 -0.407861 -0.085747 -0.689013 -0.715988 -0.681415 0.474196 -0.335328 -0.363201 -0.461447 0.358654 -0.392071 -0.341995 0.250446 0.241524 0.221610 0.228422 0.236938 0.190354 0.180716 0.192499 0.189745 0.200274 0.227863 0.262849 0.236071 0.213120 0.198015 0.228477 0.213549 0.206574 0.231453 0.213882 0.204122 0.210491 0.227373 0.211648 0.235898 0.210958 0.279760 0.225701 0.242112 0.250553 0.359073
chargesum: 0.00000
title: Mulliken charges with hydrogens summed into heavy atoms:
elementType: O O O N C C C C C C C C C C C C C C C C C C C
charge: -0.281185 -0.287094 -0.109168 -0.144154 0.086019 -0.043687 -0.008661 0.114520 0.148669 0.267130 -0.140930 0.041329 0.112269 -0.040413 -0.066530 -0.031903 0.474196 0.111528 -0.083441 -0.235746 0.358654 -0.149959 -0.091442
polarizability: 2.97072109e+02 -3.80258901e+00 2.20959952e+02 1.26190061e+01 -1.66051041e+00 1.66279465e+02
1716.lowfreq: -12.7060 -5.7827 -2.8315 -0.0005 0.0006 0.0008 5.7540 10.9453 19.3191
frequency: -10.4194 9.8792 18.5773 28.4169 35.0360 36.7417 45.8809 66.0937 76.6045 86.1242 104.5829 125.3609 135.3823 142.7577 166.1821 183.8404 202.9016 224.3720 237.8934 241.6333 252.2693 269.6722 285.9385 298.5329 326.4207 338.7967 349.6767 373.4858 386.9591 416.1713 429.8550 435.3128 446.4454 475.1224 486.0350 493.6846 507.9090 540.8806 572.7000 633.7027 663.7323 714.6993 735.6742 745.8889 764.0296 796.2532 797.8801 805.3331 812.0080 814.3049 831.0529 844.8745 856.2564 886.0840 896.2482 906.5987 922.4913 926.3466 933.1972 940.8907 942.4559 962.6092 976.9169 979.7688 984.6299 1006.1947 1016.7478 1017.0940 1021.6965 1027.5158 1036.9861 1051.9126 1059.1790 1074.6439 1077.4539 1093.3541 1104.1336 1109.0643 1115.4176 1153.2709 1162.7687 1166.5241 1179.9937 1184.5340 1210.1509 1211.6438 1215.1945 1222.5635 1228.5548 1231.6923 1240.3971 1240.6995 1269.8244 1289.3914 1301.3882 1307.0432 1321.7703 1325.4045 1335.1175 1358.9514 1367.8432 1372.7002 1376.4481 1383.9548 1399.0536 1413.5901 1417.8349 1428.2453 1443.1465 1446.7320 1451.5501 1452.1501 1460.9907 1462.5226 1466.8657 1468.9816 1473.1004 1478.4982 1479.0062 1483.5644 1489.2552 1494.4307 1502.2815 1582.4632 1623.3225 2904.0437 2916.9059 2933.6492 2954.7893 2965.0520 2967.8118 2970.0086 2973.8708 2981.8253 2986.3095 2987.2871 3037.4659 3039.8416 3061.1463 3063.8320 3070.5558 3074.0795 3081.5167 3088.2960 3092.4259 3094.3198 3102.4587 3116.5734 3130.4144 3145.0225 3158.4484 3166.6879 3189.7676 3192.8309 3209.6967 3409.0529
redmass: 3.9655 4.0991 4.2100 2.6891 3.4220 2.7847 3.9796 4.3077 3.4620 4.0723 3.3861 3.1402 3.9940 4.0703 1.4031 2.8687 1.7494 3.0471 1.6242 1.9986 2.5113 1.1082 2.8327 4.8008 2.4209 2.4437 2.5315 3.0324 2.5868 2.9347 2.4076 2.8875 2.3941 3.1583 3.3174 3.1610 2.6989 2.9231 2.7578 6.3561 1.3942 4.0230 3.4113 3.5112 1.1142 1.2161 1.9390 1.7947 4.3979 1.4496 2.2151 1.4722 2.7604 2.1100 1.9182 1.7881 1.6444 1.7773 1.3785 1.2512 1.3608 2.2379 1.5524 3.4699 3.9822 2.7415 1.4794 1.9299 1.4038 2.0454 1.7102 2.7115 1.2695 2.9498 2.7984 2.5645 1.1800 2.1834 1.3380 1.4826 1.4134 1.2218 1.2859 1.2420 2.2827 1.6354 1.7609 2.1836 1.6258 1.5381 2.6271 1.2918 1.8224 1.2016 1.2041 1.2848 1.2324 1.2647 1.6335 1.3946 1.4559 1.2107 1.2385 3.5103 1.2075 1.7632 2.6796 1.6605 1.0863 1.1859 1.0761 1.1082 1.0578 1.0537 1.1934 1.0729 1.2501 1.0804 1.1241 1.1016 1.1046 1.0580 2.2978 6.9953 6.4190 1.0551 1.0559 1.0834 1.1056 1.0961 1.0561 1.0364 1.0369 1.0594 1.0380 1.0698 1.1077 1.0999 1.0998 1.0983 1.0984 1.0994 1.0984 1.1003 1.0519 1.0995 1.0616 1.0891 1.0915 1.0880 1.0938 1.0969 1.1167 1.0630 1.1145 1.0738
irintensity: 0.4714 0.2801 0.3843 1.3003 0.3371 0.0401 1.0846 0.8759 0.3860 0.3976 2.5193 6.3797 0.9970 8.0930 0.4769 3.1634 3.4228 5.2734 1.7332 1.2431 1.6819 0.2146 1.5131 6.0995 0.2703 2.1414 3.2939 2.4689 1.7437 0.1737 0.4953 1.8875 1.2415 0.3374 8.3551 3.2391 1.8641 16.6823 12.8964 0.3678 25.0679 5.2914 3.8055 8.3617 1.9772 141.4162 30.1365 6.5633 11.6596 23.7063 27.4381 41.5126 6.9075 2.8466 2.5398 1.7566 2.3127 6.4743 2.8711 1.0337 5.0772 12.1043 12.2362 84.9954 53.4376 3.5451 5.9693 9.0684 1.1971 60.4173 108.5975 36.3477 10.3193 29.7392 53.4431 6.7032 0.3276 33.2209 18.5575 0.2410 0.5788 37.6239 100.3618 1.0232 109.2252 4.6190 27.7124 116.0414 16.8967 39.0322 21.0846 19.3364 17.4091 27.9361 4.2916 11.8569 30.0528 13.3741 3.0180 22.7142 12.9926 32.0173 26.1518 18.6189 19.9940 9.7509 4.2792 54.0211 8.8448 26.2043 1.4375 14.0809 5.2968 2.1508 4.6538 6.8207 1.2919 4.4628 71.1401 3.9261 8.2853 20.5343 146.5344 11.4671 52.2438 30.2707 135.8721 47.7621 69.5123 20.3771 32.0509 17.9165 36.5514 47.5475 11.5205 80.6339 37.4170 25.4519 24.1745 5.9876 66.7969 9.7738 67.2284 8.3660 28.1898 71.8931 10.6010 23.2312 10.5747 3.2856 15.8052 4.3697 0.6849 249.5619 36.0744 0.6876
temp: 298.150 k
press: 1.00000 atm
elementType: 8 8 8 7 6 6 6 6 6 6 6 6 6 6 6 6 6 6 6 6 6 6 6 1 1 1 1 1 1 1 1 1 1 1 1 1 1 1 1 1 1 1 1 1 1 1 1 1 1 1 1 1 1 1
symmnumber: 1
zpe: 1222468.9 jmol-1
zpe.correction: 0.465614 hartree
zpe.thermalcorrener: 0.490769 hartree
zpe.thermalcorrenthalpy: 0.491713 hartree
zpe.thermalcorrgfe: 0.406761 hartree
zpe.sumelectzpe: -1021.157843 hartree
zpe.sumelectthermal: -1021.132689 hartree
zpe.sumelectthermalent: -1021.131744 hartree
zpe.sumelectthermalfe: -1021.216696 hartree
dipole: 0.0973 1.5996 0.8282
dipole: 1.8039
quadrupole: -111.7753 -134.0924 -145.6413
quadrupole: -15.9886 -10.8914 -3.7281
quadrupole: 18.7277 -3.5894 -15.1383 -15.9886 -10.8914 -3.7281
hfenergy: -1021.6234573 hartree
pointgroup: C01 [X(C19H31N1O3)]
dipole: 0.1175547 -0.5747863 -0.3993907 debye
polarizability: 293.9404295|15.711313|223.5438384|-13.42957|3.0295254|166.8272572 unknown
InChI: InChI=1S/C19H31NO3/c1-19(2,3)20-12-17(21)14-23-18-8-6-15(7-9-18)10-11-22-13-16-4-5-16/h6-9,16-17,20-21H,4-5,10-14H2,1-3H3
charge 0 multiplicity 1
54 atoms
O  5.505878 0.710342 -0.440558
O  -1.009577 -0.205856 0.787504
O  -4.415817 0.275696 2.088653
N  -5.061136 -1.851348 0.619028
C  7.01904 -1.169941 -0.288091
C  7.718076 -2.219995 0.592245
C  6.266083 -2.437503 0.136232
C  6.645951 0.164996 0.313115
C  5.116777 2.048939 0.027647
C  -6.017498 -2.126877 -0.511273
C  3.865094 2.486883 -0.754627
C  -3.731684 -1.255598 0.307391
C  -3.272451 -0.470345 1.566973
C  -5.372126 -3.0113 -1.616487
C  -7.222398 -2.870509 0.11495
C  -6.500691 -0.784468 -1.113127
C  2.573917 1.795938 -0.334865
C  -2.174731 0.552654 1.271628
C  2.430729 0.381709 -0.417887
C  1.473171 2.545897 0.14278
C  0.142453 0.521286 0.43865
C  1.233034 -0.249409 -0.036049
C  0.259938 1.92855 0.530586
H  7.333378 -1.112805 -1.335744
H  8.503823 -2.831329 0.139797
H  7.892427 -1.974704 1.645099
H  5.470773 -2.327102 0.879929
H  6.068873 -3.199229 -0.623136
H  7.502577 0.875474 0.254737
H  6.369506 0.048217 1.38613
H  4.910852 2.02771 1.120887
H  5.952821 2.76104 -0.158455
H  3.7523 3.581587 -0.633605
H  4.074698 2.303735 -1.82736
H  -4.95323 -2.698773 1.197626
H  -2.958687 -1.991224 0.010091
H  -3.858422 -0.54063 -0.524943
H  -2.89727 -1.189918 2.329024
H  -4.490739 -2.515595 -2.062677
H  -6.093902 -3.211336 -2.429957
H  -5.04663 -3.984163 -1.201303
H  -7.68801 -2.254676 0.90484
H  -7.984275 -3.092085 -0.653006
H  -6.907271 -3.83255 0.564767
H  -7.266049 -0.970548 -1.887945
H  -6.941678 -0.148003 -0.325828
H  -5.677483 -0.221705 -1.58875
H  -1.92015 1.1087 2.195181
H  -2.522018 1.270715 0.50087
H  3.276826 -0.213898 -0.77477
H  1.555826 3.637919 0.214303
H  1.1184 -1.336496 -0.098185
H  -0.567603 2.544949 0.894056
H  -5.193201 -0.309518 1.806607
