program: Gaussian 09
title: 000185442
version: EM64L-G09RevD.01
frameworkgroup: C1[X(C14H20O5)]
method: RPBEPBE
basis: SDD
operation: Freq
keyword: #pfreq=noraman
keyword: PBEPBE/SDD
title: #p freq=noraman PBEPBE/SDD
converged: YES YES NO NO
title: Mulliken charges:
elementType: O O O O O C C C C C C C C C C C C C C H H H H H H H H H H H H H H H H H H H H
charge: -0.232540 -0.284770 -0.267445 -0.258940 -0.274213 -0.400088 -0.339299 -0.296942 -0.351492 0.293436 0.071419 0.237943 0.000394 0.151212 -0.488965 -0.693744 -0.199377 -0.519731 -0.513583 0.210323 0.216043 0.185661 0.185002 0.200445 0.202779 0.198556 0.197372 0.274507 0.218168 0.209839 0.209506 0.239866 0.223638 0.247069 0.227008 0.214723 0.251797 0.233051 0.221374
chargesum: 0.00000
title: Mulliken charges with hydrogens summed into heavy atoms:
elementType: O O O O O C C C C C C C C C C C C C C
charge: -0.232540 -0.284770 -0.267445 -0.258940 -0.274213 0.026277 0.031364 0.106282 0.044436 0.293436 0.071419 0.237943 0.000394 0.151212 -0.214458 -0.056231 0.264127 0.169068 0.192639
polarizability: 2.37800933e+02 7.31675087e+00 1.87752453e+02 4.17400212e+00 -2.44727772e-01 1.06510403e+02
1716.lowfreq: -0.0007 -0.0003 0.0003 4.2271 6.3963 9.9039 25.0071 41.0105 43.2415
frequency: 24.4916 40.9826 43.2387 57.6692 65.9992 76.1346 88.8837 122.9198 131.4004 142.0710 142.8395 149.4056 160.8427 173.1302 191.3674 199.7143 219.5738 230.3910 239.7919 285.7891 306.2468 309.3298 343.9564 382.4825 416.3649 423.4819 482.5398 505.3670 573.0497 588.5461 639.5730 655.8414 693.1069 732.1823 740.7945 762.1866 776.2853 816.7699 837.5953 842.7905 861.4525 888.9620 906.7368 933.2934 966.1855 970.6943 994.4025 1011.9167 1020.9073 1071.3275 1075.3905 1082.1816 1090.2057 1107.1490 1113.1523 1126.3584 1143.0814 1145.5922 1153.0358 1158.9282 1182.9194 1191.9193 1202.8113 1253.0773 1262.8847 1284.9252 1294.0129 1311.1607 1319.7450 1354.8335 1361.8982 1366.5376 1391.8153 1398.1207 1405.9406 1431.3154 1450.7524 1454.1793 1458.5293 1460.1153 1468.1845 1469.3283 1470.9543 1476.5850 1477.0531 1478.0622 1479.2296 1485.5017 1491.8984 1602.0492 1632.2253 2939.6640 2955.4241 2970.2227 2971.7974 2973.3011 2974.1688 2985.0769 2995.6176 2996.6776 2997.5870 3026.3946 3062.3982 3069.9954 3070.8293 3073.0533 3088.5384 3118.5716 3123.1044 3130.3288 3199.3198
redmass: 4.0224 2.9395 3.5946 1.5620 2.6345 3.4076 3.5696 2.1944 2.0208 2.7347 2.4456 2.4758 1.3645 2.3226 4.0544 2.3864 6.1850 1.1256 4.6400 3.8031 5.4935 6.7804 5.0315 8.4865 3.8720 4.0356 6.1514 6.8966 5.1590 4.9050 7.4961 8.1162 8.7547 1.0722 6.0719 2.7671 1.1939 2.2424 5.6479 6.3818 1.1880 2.3408 5.5090 6.4482 6.7762 1.1462 6.6653 5.5754 4.0997 2.4137 2.6172 1.5441 6.2619 1.2676 1.2492 2.5281 1.1201 1.4294 1.3761 1.5062 1.8920 3.8565 1.4601 1.2880 1.2398 1.0558 1.1205 4.4355 1.4933 1.5802 1.3334 2.1043 1.2254 2.6241 2.3024 1.3867 1.7745 1.8552 1.0992 1.1472 1.0679 1.0891 1.0548 1.0554 1.0755 1.0443 1.1851 1.1054 1.1064 8.7155 10.1829 1.0548 1.0587 1.0315 1.0563 1.0395 1.0648 1.0318 1.0811 1.0925 1.0900 1.1033 1.1043 1.1028 1.1013 1.0992 1.1022 1.1025 1.1046 1.1039 1.0919
irintensity: 1.2162 2.6167 1.7430 0.7041 5.8755 0.9370 6.2307 0.2793 5.1716 2.2745 1.4872 1.4770 0.4789 1.9472 4.4796 1.8162 5.4549 0.0153 9.6987 2.5177 4.7156 3.8542 5.3859 1.1606 1.3675 3.1095 1.5640 2.9337 5.9809 4.9049 2.9566 1.3867 0.5521 11.3580 4.3973 8.9972 1.2543 48.4276 13.0819 32.4005 0.1277 19.7314 5.6610 22.1149 17.0676 1.0816 299.6216 14.1640 19.0186 23.2989 17.7190 12.0799 373.8692 15.6667 7.3507 14.6184 3.3929 0.5761 6.0417 42.6899 117.4318 46.2156 1.2827 4.0088 0.0970 0.0580 0.9805 5.2623 2.2524 16.2732 2.6252 55.6719 14.9984 87.1656 13.4586 54.6497 96.4450 229.9647 8.5834 12.5720 0.4172 6.5291 28.0294 12.0098 1.5540 11.7081 15.3102 12.9652 8.8646 36.9461 98.1485 31.9328 18.7336 87.9095 62.1318 32.6436 109.3533 71.2969 24.6430 8.7264 33.9506 15.6164 21.6161 30.4311 128.8431 52.5284 31.8713 26.9487 28.3011 20.3722 1.2168
temp: 298.150 k
press: 1.00000 atm
elementType: 8 8 8 8 8 6 6 6 6 6 6 6 6 6 6 6 6 6 6 1 1 1 1 1 1 1 1 1 1 1 1 1 1 1 1 1 1 1 1
symmnumber: 1
zpe: 834555.1 jmol-1
zpe.correction: 0.317865 hartree
zpe.thermalcorrener: 0.338913 hartree
zpe.thermalcorrenthalpy: 0.339857 hartree
zpe.thermalcorrgfe: 0.266281 hartree
zpe.sumelectzpe: -920.045072 hartree
zpe.sumelectthermal: -920.024024 hartree
zpe.sumelectthermalent: -920.023080 hartree
zpe.sumelectthermalfe: -920.096656 hartree
dipole: -0.5085 -1.6318 0.1714
dipole: 1.7178
quadrupole: -90.9963 -110.3610 -113.4424
quadrupole: 1.3284 4.6066 5.2337
quadrupole: 13.9369 -5.4278 -8.5091 1.3284 4.6066 5.2337
hfenergy: -920.3629371 hartree
pointgroup: C01 [X(C14H20O5)]
dipole: 0.2635316 0.6087708 0.1292065 debye
polarizability: 238.6733741|2.7573587|185.798315|-5.0079463|8.9260557|107.5921005 unknown
InChI: InChI=1S/C14H20O5/c1-4-5-6-7-17-10-8-11-13(19-9-18-11)14(16-3)12(10)15-2/h8H,4-7,9H2,1-3H3
charge 0 multiplicity 1
39 atoms
O  -1.465963 -0.546989 0.065549
O  3.981139 0.806631 0.378199
O  2.389775 2.562523 0.662402
O  0.311932 -2.515891 -0.444268
O  3.052689 -2.129375 -0.209661
C  -3.843746 -0.12043 0.090166
C  -4.985682 0.912812 0.228135
C  -2.464017 0.527583 0.220327
C  -6.387473 0.274323 0.09698
C  -0.114292 -0.184591 0.112788
C  2.648833 0.309216 0.178147
C  1.71551 1.342881 0.361039
C  0.812733 -1.251195 -0.095939
C  2.225564 -1.012824 -0.054475
C  0.335081 1.148097 0.340763
C  -7.530028 1.304088 0.228973
C  3.806429 2.280392 0.334171
C  0.486016 -3.568697 0.579036
C  4.397935 -1.9092 -0.777435
H  -3.946227 -0.904151 0.86511
H  -3.907413 -0.629138 -0.890537
H  -4.872604 1.701167 -0.545474
H  -4.910706 1.425352 1.21031
H  -2.344128 1.010011 1.213932
H  -2.309841 1.295285 -0.567472
H  -6.462043 -0.240238 -0.882388
H  -6.502845 -0.511572 0.870682
H  -0.347923 1.982206 0.505303
H  -8.520559 0.822994 0.13236
H  -7.454691 2.08235 -0.553881
H  -7.495512 1.812145 1.211315
H  4.451986 2.738556 1.096867
H  4.01711 2.640035 -0.693595
H  1.558235 -3.750154 0.771715
H  0.018171 -4.468247 0.150412
H  -0.031778 -3.286052 1.515828
H  5.019739 -1.293164 -0.106676
H  4.824596 -2.917573 -0.88451
H  4.323497 -1.422165 -1.767401
