program: Gaussian 09
title: 000185439
version: EM64L-G09RevD.01
frameworkgroup: C1[X(C11H14O4)]
method: RPBEPBE
basis: SDD
operation: Freq
keyword: #pfreq=noraman
keyword: PBEPBE/SDD
title: #p freq=noraman PBEPBE/SDD
converged: YES YES NO NO
title: Mulliken charges:
elementType: O O O O C C C C C C C C C C C H H H H H H H H H H H H H H
charge: -0.243636 -0.270021 -0.270403 -0.236699 0.188278 0.257200 0.184000 0.183298 -0.444311 -0.258164 -0.452910 -0.391533 -0.202541 -0.676552 -0.536868 0.273024 0.197959 0.210559 0.264761 0.219467 0.191597 0.224986 0.238457 0.251809 0.213408 0.200151 0.218969 0.219566 0.246150
chargesum: 0.00000
title: Mulliken charges with hydrogens summed into heavy atoms:
elementType: O O O O C C C C C C C C C C C
charge: -0.243636 -0.270021 -0.270403 -0.236699 0.188278 0.257200 0.184000 0.183298 -0.171287 0.150354 -0.188149 0.019531 0.260902 -0.011185 0.147817
polarizability: 1.85816419e+02 -9.68032184e+00 1.45928769e+02 3.14932665e+00 1.65030288e+00 7.90319157e+01
1716.lowfreq: -0.0008 -0.0005 -0.0002 1.4004 7.6364 9.3290 42.5362 50.0817 83.5447
frequency: 42.5239 50.0716 83.5404 101.7711 118.4678 129.0627 157.9103 187.6448 189.9866 199.0958 241.5048 279.6549 298.1980 325.5909 354.5836 361.3889 406.9884 445.6396 467.4957 546.7494 587.0225 655.5202 670.4993 723.8828 725.6360 734.7803 777.3298 824.8053 831.2324 833.4815 841.8156 885.4540 915.6979 932.5337 968.1066 976.9390 1030.4094 1073.7744 1076.7023 1106.4762 1112.4920 1134.9340 1138.4463 1153.8073 1156.2789 1173.7862 1230.1387 1234.4626 1274.2201 1314.2840 1352.1803 1358.9804 1360.6774 1389.7281 1398.2183 1414.4556 1444.8258 1454.9092 1466.7952 1468.5757 1471.9265 1476.5533 1481.2406 1489.7951 1498.4130 1620.4285 1637.4503 2940.1877 2952.9497 2979.8579 2981.3854 2988.1355 3005.1467 3038.4502 3046.0825 3075.4858 3098.5875 3114.7659 3124.0513 3189.6486 3192.9387
redmass: 3.9890 2.7082 3.5126 3.0025 2.5275 3.0913 3.3507 4.1560 3.2839 1.6064 1.4276 2.0123 3.3407 4.1644 5.6272 5.9859 2.8201 3.2100 6.4540 4.2910 4.5025 10.9594 8.7377 6.1118 2.3567 2.8223 2.0523 2.6146 2.0251 2.0448 3.9875 2.7115 1.8502 1.8198 6.1130 4.5576 5.3881 1.9085 1.5427 2.0567 1.2601 1.1060 1.6785 1.6519 1.6190 5.0385 1.2192 1.3256 1.2018 6.4763 1.4390 1.3163 1.6109 1.3865 2.6595 3.8071 1.4058 1.0788 1.0525 1.1988 1.0904 1.1025 1.0990 1.0560 2.2488 7.6044 10.5799 1.0548 1.0334 1.0643 1.0381 1.0691 1.0980 1.1037 1.0995 1.0994 1.1002 1.1060 1.0988 1.0917 1.0920
irintensity: 0.7654 2.0962 6.8355 1.8091 7.8968 1.6032 0.5685 10.9394 1.1575 2.3238 0.4843 1.8135 0.5082 1.6282 7.0775 3.3850 0.2918 3.2741 2.1506 1.7440 1.5818 0.3080 0.3919 8.6807 0.0529 4.3399 6.2384 12.6271 76.4992 46.4459 20.3149 1.8936 28.4822 51.9547 19.6888 193.3423 31.7614 11.9721 7.3483 8.8334 0.1285 10.9446 1.7605 121.6431 218.9913 239.1090 2.3190 3.5031 2.8825 4.6773 8.6745 6.2900 46.1638 54.1606 28.1355 29.3931 33.3517 9.8404 14.9529 119.2671 69.2706 19.0344 15.2952 16.5990 198.1639 20.6773 0.1982 42.9319 69.5626 147.3536 27.7147 22.5058 63.4051 51.2736 18.0402 61.7299 36.2087 32.3177 21.4967 2.9720 1.0034
temp: 298.150 k
press: 1.00000 atm
elementType: 8 8 8 8 6 6 6 6 6 6 6 6 6 6 6 1 1 1 1 1 1 1 1 1 1 1 1 1 1
symmnumber: 1
zpe: 607676.9 jmol-1
zpe.correction: 0.231452 hartree
zpe.thermalcorrener: 0.246394 hartree
zpe.thermalcorrenthalpy: 0.247338 hartree
zpe.thermalcorrgfe: 0.188945 hartree
zpe.sumelectzpe: -727.259289 hartree
zpe.sumelectthermal: -727.244346 hartree
zpe.sumelectthermalent: -727.243402 hartree
zpe.sumelectthermalfe: -727.301795 hartree
dipole: 0.1039 0.0678 -0.4988
dipole: 0.5140
quadrupole: -81.6397 -76.3861 -90.4011
quadrupole: 3.1283 -1.4048 1.1918
quadrupole: 1.1693 6.4229 -7.5922 3.1283 -1.4048 1.1918
hfenergy: -727.4907404 hartree
pointgroup: C01 [X(C11H14O4)]
dipole: 0.033526 0.0107025 0.1991306 debye
polarizability: 186.9143544|7.0469881|143.1100136|-1.362399|-10.9590857|80.7527356 unknown
InChI: InChI=1S/C11H14O4/c1-3-4-13-9-6-11-10(14-7-15-11)5-8(9)12-2/h5-6H,3-4,7H2,1-2H3
charge 0 multiplicity 1
29 atoms
O  -1.964524 0.22131 0.040347
O  2.785583 1.705475 -0.529185
O  3.586914 -0.526888 -0.171389
O  -1.086084 -2.234962 0.429794
C  1.69907 0.823258 -0.254507
C  -0.574736 0.066547 -0.009457
C  2.166999 -0.479606 -0.045116
C  -0.093666 -1.269318 0.204596
C  0.335012 1.13263 -0.246409
C  -2.512755 1.567605 -0.208372
C  1.298564 -1.551954 0.18497
C  -4.037592 1.447307 -0.135205
C  3.99022 0.903472 -0.190771
C  -4.622942 0.539223 -1.23701
C  -0.637005 -3.610353 0.643831
H  -0.005265 2.155373 -0.416842
H  -2.18925 1.920357 -1.211177
H  -2.129142 2.270499 0.560966
H  1.686913 -2.560496 0.338188
H  -4.310851 1.055389 0.862642
H  -4.462966 2.468063 -0.211258
H  4.341522 1.191718 0.820184
H  4.750411 1.051007 -0.971933
H  -4.1894 -0.472833 -1.167649
H  -5.720609 0.457178 -1.14143
H  -4.398752 0.939892 -2.243984
H  0.007662 -3.690606 1.541665
H  -0.092697 -4.001276 -0.238684
H  -1.558638 -4.190613 0.797191
