program: Gaussian 09
title: 000185436
version: EM64L-G09RevD.01
frameworkgroup: C1[X(C7H9ClF3NO3S)]
method: RPBEPBE
basis: SDD
operation: Freq
keyword: #p
keyword: freq=noraman
keyword: PBEPBE/SDD
title: #p freq=noraman PBEPBE/SDD
converged: YES YES NO NO
title: Mulliken charges:
elementType: Cl S F F F O O O N C C C C C C C H H H H H H H H H
charge: 0.045002 0.241857 -0.140291 -0.172975 -0.145798 -0.420309 -0.216173 -0.279618 -0.378781 -0.113445 -0.680962 0.099099 0.175425 -0.228632 0.269161 -0.771281 0.307132 0.336617 0.302350 0.349972 0.289685 0.254447 0.219266 0.262490 0.395762
chargesum: 0.00000
title: Mulliken charges with hydrogens summed into heavy atoms:
elementType: Cl S F F F O O O N C C C C C C C
charge: 0.045002 0.241857 -0.140291 -0.172975 -0.145798 -0.024547 -0.216173 -0.279618 -0.028809 0.193687 -0.041995 0.099099 0.175425 0.061052 0.269161 -0.035078
polarizability: 1.16556187e+02 3.99632010e+00 1.23906069e+02 6.25126924e-01 4.74918180e+00 1.11429361e+02
1716.lowfreq: -9.7266 -5.6064 -4.7535 -0.0022 -0.0006 0.0005 20.2886 27.0528 40.9477
frequency: 19.8902 26.8807 40.8780 52.3251 58.6241 62.7185 80.4006 89.7341 103.1343 139.9231 157.6351 198.7804 226.4520 253.5526 283.9401 293.8769 328.1514 352.8395 358.1273 385.3639 399.7910 461.3198 505.2985 509.4579 516.4412 559.2049 586.8756 604.8997 624.7744 651.0145 720.4318 727.0704 755.1679 817.9827 890.9184 899.9012 915.3292 945.7593 980.1075 984.5363 994.8944 1042.5543 1084.9129 1120.0644 1142.1548 1187.7058 1221.9830 1239.4509 1249.5131 1285.9196 1309.5922 1322.8008 1330.4415 1387.7714 1421.5818 1447.0377 1465.7821 1479.4771 1608.3489 1667.6248 2967.5254 3000.0475 3055.5887 3093.0531 3105.1542 3118.6130 3140.4193 3521.9167 3571.9354
redmass: 9.2873 11.7699 7.3509 9.2825 14.7850 6.2554 1.6985 1.8865 9.4812 6.6864 7.2507 8.4188 9.8293 4.3669 18.2478 13.0481 3.3424 4.1200 16.8838 12.1273 13.4217 3.2337 3.6605 10.1906 4.0726 1.4446 2.8173 3.7349 2.8149 1.7306 4.5235 7.4561 7.2690 3.2924 9.9406 2.6107 7.7930 4.7394 3.9402 4.2358 1.5750 1.6694 1.7973 5.9551 2.0915 1.5849 1.1691 1.4789 1.3753 1.6551 1.2560 1.5492 1.9029 1.2325 1.0840 1.1264 1.1107 1.8094 6.1900 9.4342 1.0803 1.0366 1.0585 1.0981 1.0879 1.1001 1.1075 1.0643 1.0787
irintensity: 1.4946 0.3117 1.0445 3.5411 0.4565 10.7846 4.6827 1.5450 2.0671 1.5889 3.0249 5.3413 0.9157 4.6067 1.0268 1.9825 3.7626 1.4842 5.0507 3.7931 0.9459 16.8133 16.7991 20.8844 46.7557 101.7046 71.4856 10.5663 52.3875 102.8052 23.8085 43.1369 115.0033 10.5682 186.7047 9.5543 74.8016 21.6522 130.9450 21.9348 4.2051 15.9170 165.9226 42.5862 10.0943 20.8630 5.7755 17.8528 8.5871 51.9626 0.9070 38.8760 24.3674 64.8574 29.9696 76.4239 52.5939 186.2768 140.4818 209.4476 19.2112 5.6075 2.6976 12.4354 5.2480 10.9425 0.7207 39.5716 46.6382
temp: 298.150 k
press: 1.00000 atm
elementType: 17 16 9 9 9 8 8 8 7 6 6 6 6 6 6 6 1 1 1 1 1 1 1 1 1
symmnumber: 1
zpe: 431573.0 jmol-1
zpe.correction: 0.164377 hartree
zpe.thermalcorrener: 0.182645 hartree
zpe.thermalcorrenthalpy: 0.183589 hartree
zpe.thermalcorrgfe: 0.114418 hartree
zpe.sumelectzpe: -1708.973417 hartree
zpe.sumelectthermal: -1708.955149 hartree
zpe.sumelectthermalent: -1708.954205 hartree
zpe.sumelectthermalfe: -1709.023377 hartree
dipole: -0.9837 -1.8168 3.3813
dipole: 3.9625
quadrupole: -109.3480 -110.6233 -105.0624
quadrupole: -3.0585 -8.8820 1.2006
quadrupole: -1.0034 -2.2787 3.2822 -3.0585 -8.8820 1.2006
hfenergy: -1709.1377942 hartree
pointgroup: C01 [X(C7H9Cl1F3N1O3S1)]
dipole: -0.1537739 -0.998737 1.1871251 debye
dipolederiv: -0.3469438 -0.0401899 0.1805164 -0.0874841 -0.1189464 0.0243893 0.2132126 -0.0063411 -0.3811459 -0.3138532 -0.1904497 -0.0504786 -0.1911079 -0.1445462 -0.1595795 -0.1665333 -0.1009074 -0.2335571 -0.3739905 0.1195057 -0.0735914 0.009605 -0.6888629 0.1109039 -0.0758012 0.1457271 -0.3221917 -0.5283645 0.0603699 0.2867773 -0.034992 -0.3341917 -0.108043 0.0677015 -0.192434 -0.7508012 -0.39129 -0.1097354 -0.0751888 -0.0895173 -0.5082939 -0.4023616 -0.0330549 -0.2394994 -0.5596658 -0.4754779 -0.0308013 0.2000861 -0.059385 -0.313851 0.0601903 0.2955614 0.0219486 -1.0970544 -0.3700791 -0.0117531 0.0626009 -0.0070887 -0.9573121 -0.2866799 0.1105824 -0.0378917 -0.6220235 -0.4595945 0.1304157 -0.085192 0.1532655 -0.6932325 -0.0010976 -0.1949763 0.2327928 -0.8670804 -0.6250025 0.1621986 0.0479046 0.3102467 -1.1355567 0.1527041 0.0558001 0.1438763 -0.4308476 0.1733355 -0.0072346 -0.075749 -0.1430171 0.1873294 0.1453133 -0.2457883 0.436878 0.0506337 0.4964585 0.0995695 0.1427765 0.0120551 -0.1756178 0.0381352 0.2168499 -0.081559 0.1568324 0.7954636 -0.1051376 -0.2297251 0.3237321 1.1674245 0.1876944 0.1986136 0.2154226 1.0096466 0.3420596 0.0504494 -0.2432896 0.1597036 1.2750091 0.1245324 -0.3989587 -0.0792569 1.3400302 0.7702782 0.2349811 -0.0772143 0.0168376 0.5901973 0.3099369 -0.3416391 0.1498685 1.0200954 0.3861422 -0.3646047 0.1553088 -0.5149551 1.4314132 -0.0833143 0.2641571 -0.2659743 1.0077748 0.0178168 -0.011033 -0.0201528 0.0582748 -0.2882808 -0.2203378 0.0141139 -0.2014307 -0.1136569 -0.0084923 -0.0588825 -0.045545 -0.0008709 0.1248807 0.0074101 0.0367177 -0.1017279 0.0706916 -0.0001268 -0.0405425 -0.0440481 -0.0338926 0.0583721 0.0611569 -0.0319578 0.0456593 0.0824755 -0.0080197 0.0193393 -0.0364874 0.0532552 0.0617761 -0.0758579 -0.0088166 -0.0835183 0.0520262 0.373655 0.0542632 -0.0642584 0.0683765 0.2173419 -0.0230278 -0.0203681 -0.0534284 0.1779373 0.0340616 -0.0094867 0.0449622 0.0018646 -0.0257855 0.0164339 0.0333209 0.0575041 -0.0008097 -0.0130253 0.1224942 -0.0084941 0.0835561 0.0635778 0.0048692 -0.0530746 0.0112355 0.0835834 0.1208551 0.0095428 0.005063 -0.0105427 0.034879 0.1057074 0.0224419 0.030438 -0.1023358 0.0010786 -0.1017983 0.0095106 -0.076414 0.0746603 -0.0009735 0.0370333 -0.003039 0.0810106 0.4030554 0.0185199 -0.0060919 -0.0015052 0.097616 0.0118956 0.0048625 -0.0443427 0.3484324 unknown
polarizability: 114.9066244|1.0090113|123.7802229|-0.739968|6.6658165|113.2047691 unknown
InChI: InChI=1S/C7H9ClF3NO3S/c1-3(13)12-4(5(14)15)2-16-7(10,11)6(8)9/h4,6,12,14H,2H2,1H3
charge 0 multiplicity 1
25 atoms
Cl 3.916953 0.907298 -0.595567
S  1.088069 -1.151975 -0.338807
F  0.908572 1.588872 -0.214882
F  0.640332 0.528589 1.78432
F  3.000543 1.78496 1.760451
O  -2.276453 -2.184573 1.374295
O  -1.810977 -3.320083 -0.599671
O  -2.569754 1.679039 -1.366689
N  -1.974165 0.230684 0.335026
C  -1.793265 -0.863433 -0.61243
C  -0.452804 -0.786484 -1.388497
C  1.372053 0.475199 0.533503
C  -1.957305 -2.244992 0.016502
C  2.863419 0.650856 0.908966
C  -2.350954 1.483415 -0.130003
C  -2.450191 2.579715 0.91788
H  -2.576192 -0.75591 -1.394473
H  -0.340623 0.208916 -1.84313
H  -0.408985 -1.567608 -2.164938
H  -1.790703 0.06079 1.324604
H  3.246151 -0.235677 1.437272
H  -3.328217 3.208637 0.700466
H  -2.521695 2.190849 1.947758
H  -1.553116 3.221339 0.850357
H  -2.362291 -3.105625 1.741687
